{"text_format":"3","workbook":"xlsx","n_sheets":59,"sheets":["Cat. Res","Resultados","Aplicabilidad","Art 74_I","Art 74_II","Art 74_III","Art 74_IV","Art 74_V","Art 74_VI","Art 74_VII","Art 74_VIII","Art 74_IX","Art 74_X","Art 74_XI","Art 74_XII","Art 74_XIII","Art 74_XIV","Art 74_XV","Art 74_XVI","Art 74_XVII","Art 74_XVIII","Art 74_XIX","Art 74_XX","Art 74_XXI","Art 74_XXII","Art 74_XXIII","Art 74_XXIV","Art 74_XXV","Art 74_XXVI","Art 74_XXVII","Art 74_XXVIII","Art 74_XXIX","Art 74_XXX","Art 74_XXXI","Art 74_XXXII","Art 74_XXXIII","Art 74_XXXIV","Art 74_XXXV","Art 74_XXXVI","Art 74_XXXVII","Art 74_XXXVIII","Art 74_XXXIX","Art 74_XL","Art 74_XLI","Art 74_XLII","Art 74_XLIII","Art 74_XLIV","Art 74_XLV","Art 74_XLVI","Art 74_XLVII","Art 74_XLVIII","Art 74_Ult.P","Art 75_I","Art 75_II","Art 75_III","Art 75_IV","Art 75_V","Art 71_I_F","Art 75_VI"],"not_rendered":{"images":3,"macros":1,"external_links":1,"defined_names":92},"read":"whole","date_system":"1900"}

{"sheet":"Cat. Res","index":0,"n_rows":152,"n_cols":11,"rows_kept":152,"hidden":true}
[null,null,"Aplica?",{"$nulls":3},"Tipo",null,"Sujeto Obligado","Clave","Categoría"]
[1,null,"SI",{"$nulls":3},"Observación",null,"Administración Portuaria Integral de Campeche, S.A. de C.V.",{"v":1,"d":"001"},"PODER EJECUTIVO"]
[0.5,null,"NO",{"$nulls":3},"Recomendación",null,"Comisión de Conciliación y Arbitraje Médico del Estado de Campeche",{"v":2,"d":"002"},"PODER EJECUTIVO"]
[0,{"$nulls":5},"Requerimiento",null,"Consejería Jurídica",{"v":3,"d":"003"},"PODER EJECUTIVO"]
["Justificado",{"$nulls":7},"Fiscalía General del Estado de Campeche",{"v":4,"d":"004"},"PODER EJECUTIVO"]
[{"$nulls":8},"Oficina del Gobernador",{"v":5,"d":"005"},"PODER EJECUTIVO"]
[{"$nulls":4},"Mauricio Preve Grajales",{"$nulls":3},"Secretaría de Administración e Innovación Gubernamental",{"v":6,"d":"006"},"PODER EJECUTIVO"]
[{"$nulls":4},"Ricardo Manuel Chi Gallardo",{"$nulls":3},"Instituto de Seguridad y Servicios Sociales de los Trabajadores del Estado de Campeche",{"v":7,"d":"007"},"PODER EJECUTIVO"]
[{"$nulls":4},"Erick Raymundo Zabala Pérez",{"$nulls":3},"Secretaría de Cultura",{"v":8,"d":"008"},"PODER EJECUTIVO"]
[{"$nulls":4},"Francisco Javier Pech Rosado",{"$nulls":3},"Secretaría de Desarrollo Económico",{"v":9,"d":"009"},"PODER EJECUTIVO"]
[{"$nulls":8},"Instituto Estatal para el Fomento de las Actividades Artesanales en Campeche",{"v":10,"d":"010"},"PODER EJECUTIVO"]
[{"$nulls":8},"Secretaría de Desarrollo Energético Sustentable ",{"v":11,"d":"011"},"PODER EJECUTIVO"]
[{"$nulls":4},"Gabriela Ortiz Gutierrez",{"$nulls":3},"Agencia de Energía del Estado de Campeche",{"v":12,"d":"012"},"PODER EJECUTIVO"]
[{"$nulls":8},"Secretaría de Desarrollo Rural",{"v":13,"d":"013"},"PODER EJECUTIVO"]
[{"$nulls":8},"Secretaría de Desarrollo Social y Humano",{"v":14,"d":"014"},"PODER EJECUTIVO"]
[{"$nulls":8},"Comisión Estatal de Desarrollo de Suelo y Vivienda",{"v":15,"d":"015"},"PODER EJECUTIVO"]
[{"$nulls":8},"Instituto del Deporte del Estado de Campeche",{"v":16,"d":"016"},"PODER EJECUTIVO"]
[{"$nulls":8},"Instituto de Desarrollo y Formación Social del Estado de Campeche",{"v":17,"d":"017"},"PODER EJECUTIVO"]
[{"$nulls":8},"Instituto de la Juventud del Estado de Campeche",{"v":18,"d":"018"},"PODER EJECUTIVO"]
[{"$nulls":8},"Instituto de la Mujer del Estado de Campeche",{"v":19,"d":"019"},"PODER EJECUTIVO"]
[{"$nulls":8},"Secretaría de Desarrollo Urbano, Obras Públicas e Infraestructura",{"v":20,"d":"020"},"PODER EJECUTIVO"]
[{"$nulls":8},"Comisión de Agua Potable y Alcantarillado del Estado de Campeche",{"v":21,"d":"021"},"PODER EJECUTIVO"]
[{"$nulls":8},"Secretaría de Educación",{"v":22,"d":"022"},"PODER EJECUTIVO"]
[{"$nulls":8},"Colegio de Bachilleres del Estado de Campeche",{"v":23,"d":"023"},"PODER EJECUTIVO"]
[{"$nulls":8},"Colegio de Educación Profesional Técnica del Estado de Campeche",{"v":24,"d":"024"},"PODER EJECUTIVO"]
[{"$nulls":8},"Consejo Estatal de Investigación Científica y Desarrollo Tecnológico",{"v":25,"d":"025"},"PODER EJECUTIVO"]
[{"$nulls":8},"Colegio de Estudios Científicos y Tecnológicos del Estado de Campeche",{"v":26,"d":"026"},"PODER EJECUTIVO"]
[{"$nulls":8},"Instituto de Capacitación para el Trabajo del Estado de Campeche",{"v":27,"d":"027"},"PODER EJECUTIVO"]
[{"$nulls":8},"Instituto Estatal de la Educación para los Adultos",{"v":28,"d":"028"},"PODER EJECUTIVO"]
[{"$nulls":8},"Instituto de la Infraestructura Física Educativa del Estado de Campeche",{"v":29,"d":"029"},"PODER EJECUTIVO"]
[{"$nulls":8},"Instituto Tecnológico Superior de Calkiní",{"v":30,"d":"030"},"PODER EJECUTIVO"]
[{"$nulls":8},"Instituto Tecnológico Superior de Champotón",{"v":31,"d":"031"},"PODER EJECUTIVO"]
[{"$nulls":8},"Instituto Tecnológico Superior de Escárcega",{"v":32,"d":"032"},"PODER EJECUTIVO"]
[{"$nulls":8},"Instituto Tecnológico Superior de Hopelchén",{"v":33,"d":"033"},"PODER EJECUTIVO"]
[{"$nulls":8},"Universidad Tecnológica de Calakmul",{"v":34,"d":"034"},"PODER EJECUTIVO"]
[{"$nulls":8},"Universidad Tecnológica de Campeche",{"v":35,"d":"035"},"PODER EJECUTIVO"]
[{"$nulls":8},"Universidad Tecnológica de Candelaria",{"v":36,"d":"036"},"PODER EJECUTIVO"]
[{"$nulls":8},"Fundación Pablo García",{"v":37,"d":"037"},"PODER EJECUTIVO"]
[{"$nulls":8},"Secretaría de Finanzas",{"v":38,"d":"038"},"PODER EJECUTIVO"]
[{"$nulls":8},"Secretaría de la Contraloría",{"v":39,"d":"039"},"PODER EJECUTIVO"]
[{"$nulls":8},"Secretaría de Medio Ambiente, Biodiversidad y Cambio Climático",{"v":40,"d":"040"},"PODER EJECUTIVO"]
[{"$nulls":8},"Promotora para la Conservación y Desarrollo Sustentable del Estado de Campeche",{"v":41,"d":"041"},"PODER EJECUTIVO"]
[{"$nulls":8},"Secretaría de Pesca y Acuacultura",{"v":42,"d":"042"},"PODER EJECUTIVO"]
[{"$nulls":8},"Secretaría de Planeación",{"v":43,"d":"043"},"PODER EJECUTIVO"]
[{"$nulls":8},"Instituto de Información Estadística, Geográfica y Catastral del Estado de Campeche",{"v":44,"d":"044"},"PODER EJECUTIVO"]
[{"$nulls":8},"Secretaría de Protección Civil",{"v":45,"d":"045"},"PODER EJECUTIVO"]
[{"$nulls":8},"Secretaría de Salud",{"v":46,"d":"046"},"PODER EJECUTIVO"]
[{"$nulls":8},"Hospital Dr. Manuel Campos",{"v":47,"d":"047"},"PODER EJECUTIVO"]
[{"$nulls":8},"Hospital Psiquiátrico de Campeche",{"v":48,"d":"048"},"PODER EJECUTIVO"]
[{"$nulls":8},"Instituto de Servicios Descentralizados de Salud Pública del Estado de Campeche",{"v":49,"d":"049"},"PODER EJECUTIVO"]
[{"$nulls":8},"Régimen Estatal de Protección Social en Salud",{"v":50,"d":"050"},"PODER EJECUTIVO"]
[{"$nulls":8},"Sistema de Atención a Niños, Niñas y Adolescentes Farmacodependientes del Estado de Campeche “Vida Nueva”",{"v":51,"d":"051"},"PODER EJECUTIVO"]
[{"$nulls":8},"Sistema para el Desarrollo Integral de la Familia del Estado de Campeche",{"v":52,"d":"052"},"PODER EJECUTIVO"]
[{"$nulls":8},"Secretaría de Seguridad Pública",{"v":53,"d":"053"},"PODER EJECUTIVO"]
[{"$nulls":8},"Secretaría de Trabajo y Previsión Social",{"v":54,"d":"054"},"PODER EJECUTIVO"]
[{"$nulls":8},"Centro de Conciliación Laboral del Estado de Campeche",{"v":55,"d":"055"},"PODER EJECUTIVO"]
[{"$nulls":8},"Secretaría de Turismo",{"v":56,"d":"056"},"PODER EJECUTIVO"]
[{"$nulls":8},"Promotora de Eventos Artísticos, Culturales y de Convenciones del Estado de Campeche",{"v":57,"d":"057"},"PODER EJECUTIVO"]
[{"$nulls":8},"Secretaría General de Gobierno",{"v":58,"d":"058"},"PODER EJECUTIVO"]
[{"$nulls":8},"Instituto de Acceso a la Justicia del Estado de Campeche",{"v":59,"d":"059"},"PODER EJECUTIVO"]
[{"$nulls":8},"Sistema de Televisión y Radio de Campeche",{"v":60,"d":"060"},"PODER EJECUTIVO"]
[{"$nulls":8},"Secretaría Ejecutiva del Sistema Anticorrupción del Estado de Campeche",{"v":61,"d":"061"},"PODER EJECUTIVO"]
[{"$nulls":8},"Auditoría Superior del Estado de Campeche",{"v":62,"d":"062"},"PODER LEGISLATIVO"]
[{"$nulls":8},"Congreso del Estado de Campeche",{"v":63,"d":"063"},"PODER LEGISLATIVO"]
[{"$nulls":8},"Tribunal Superior de Justicia del Estado de Campeche",{"v":64,"d":"064"},"PODER JUDICIAL"]
[{"$nulls":8},"Municipio de Calakmul",{"v":65,"d":"065"},"MUNICIPIOS"]
[{"$nulls":8},"Sistema Municipal para el Desarrollo Integral de la Familia de Calakmul",{"v":66,"d":"066"},"MUNICIPIOS"]
[{"$nulls":8},"Junta Municipal de Constitución",{"v":67,"d":"067"},"MUNICIPIOS"]
[{"$nulls":8},"Municipio de Calkiní",{"v":68,"d":"068"},"MUNICIPIOS"]
[{"$nulls":8},"Sistema Municipal para el Desarrollo Integral de la Familia de Calkiní",{"v":69,"d":"069"},"MUNICIPIOS"]
[{"$nulls":8},"Junta Municipal de Bécal",{"v":70,"d":"070"},"MUNICIPIOS"]
[{"$nulls":8},"Junta Municipal de Nunkiní ",{"v":71,"d":"071"},"MUNICIPIOS"]
[{"$nulls":8},"Municipio de Campeche ",{"v":72,"d":"072"},"MUNICIPIOS"]
[{"$nulls":8},"Sistema Municipal para el Desarrollo Integral de la Familia de Campeche",{"v":73,"d":"073"},"MUNICIPIOS"]
[{"$nulls":8},"Sistema Municipal de Agua Potable y Alcantarillado de Campeche ",{"v":74,"d":"074"},"MUNICIPIOS"]
[{"$nulls":8},"Junta Municipal de Alfredo V. Bonfil ",{"v":75,"d":"075"},"MUNICIPIOS"]
[{"$nulls":8},"Junta Municipal de Hampolol",{"v":76,"d":"076"},"MUNICIPIOS"]
[{"$nulls":8},"Junta Municipal de Pich",{"v":77,"d":"077"},"MUNICIPIOS"]
[{"$nulls":8},"Junta Municipal de Tixmucuy",{"v":78,"d":"078"},"MUNICIPIOS"]
[{"$nulls":8},"Municipio de Candelaria",{"v":79,"d":"079"},"MUNICIPIOS"]
[{"$nulls":8},"Sistema Municipal para el Desarrollo Integral de la Familia de Candelaria",{"v":80,"d":"080"},"MUNICIPIOS"]
[{"$nulls":8},"Junta Municipal de Miguel Hidalgo",{"v":81,"d":"081"},"MUNICIPIOS"]
[{"$nulls":8},"Junta Municipal de Monclova ",{"v":82,"d":"082"},"MUNICIPIOS"]
[{"$nulls":8},"Municipio de Carmen",{"v":83,"d":"083"},"MUNICIPIOS"]
[{"$nulls":8},"Sistema Municipal para el Desarrollo Integral de la Familia de Carmen",{"v":84,"d":"084"},"MUNICIPIOS"]
[{"$nulls":8},"Sistema Municipal de Agua Potable y Alcantarillado de Carmen",{"v":85,"d":"085"},"MUNICIPIOS"]
[{"$nulls":8},"Instituto del Deporte y de la Juventud de Carmen",{"v":86,"d":"086"},"MUNICIPIOS"]
[{"$nulls":8},"Instituto Municipal de la Mujer de Carmen",{"v":87,"d":"087"},"MUNICIPIOS"]
[{"$nulls":8},"Instituto Municipal de la Vivienda de Carmen",{"v":88,"d":"088"},"MUNICIPIOS"]
[{"$nulls":8},"Instituto Municipal de Planeación de Carmen",{"v":89,"d":"089"},"MUNICIPIOS"]
[{"$nulls":8},"Junta Municipal de Atasta",{"v":90,"d":"090"},"MUNICIPIOS"]
[{"$nulls":8},"Junta Municipal de Mamantel ",{"v":91,"d":"091"},"MUNICIPIOS"]
[{"$nulls":8},"Junta Municipal de Sabancuy",{"v":92,"d":"092"},"MUNICIPIOS"]
[{"$nulls":8},"Municipio de Champotón",{"v":93,"d":"093"},"MUNICIPIOS"]
[{"$nulls":8},"Sistema Municipal para el Desarrollo Integral de la Familia de Champotón",{"v":94,"d":"094"},"MUNICIPIOS"]
[{"$nulls":8},"Junta Municipal de Felipe Carrillo Puerto del Municipio de Champotón",{"v":95,"d":"095"},"MUNICIPIOS"]
[{"$nulls":8},"Junta Municipal de Hool ",{"v":96,"d":"096"},"MUNICIPIOS"]
[{"$nulls":8},"Junta Municipal de Sihochac ",{"v":97,"d":"097"},"MUNICIPIOS"]
[{"$nulls":8},"Municipio de Escárcega",{"v":98,"d":"098"},"MUNICIPIOS"]
[{"$nulls":8},"Sistema Municipal para el Desarrollo Integral de la Familia de Escárcega",{"v":99,"d":"099"},"MUNICIPIOS"]
[{"$nulls":8},"Sistema Municipal de Agua Potable y Alcantarillado de Escárcega",100,"MUNICIPIOS"]
[{"$nulls":8},"Junta Municipal de Centenario ",101,"MUNICIPIOS"]
[{"$nulls":8},"Junta Municipal de División del Norte",102,"MUNICIPIOS"]
[{"$nulls":8},"Municipio de Hecelchakán",103,"MUNICIPIOS"]
[{"$nulls":8},"Sistema Municipal para el Desarrollo Integral de la Familia de Hecelchakán",104,"MUNICIPIOS"]
[{"$nulls":8},"Junta Municipal de Pomuch",105,"MUNICIPIOS"]
[{"$nulls":8},"Municipio de Hopelchén",106,"MUNICIPIOS"]
[{"$nulls":8},"Sistema Municipal para el Desarrollo Integral de la Familia de Hopelchén",107,"MUNICIPIOS"]
[{"$nulls":8},"Junta Municipal de Bolonchén de Rejón ",108,"MUNICIPIOS"]
[{"$nulls":8},"Junta Municipal de Dzibalchén ",109,"MUNICIPIOS"]
[{"$nulls":8},"Junta Municipal de Ukum ",110,"MUNICIPIOS"]
[{"$nulls":8},"Municipio de Palizada",111,"MUNICIPIOS"]
[{"$nulls":8},"Sistema Municipal para el Desarrollo Integral de la Familia de Palizada",112,"MUNICIPIOS"]
[{"$nulls":8},"Municipio de Tenabo",113,"MUNICIPIOS"]
[{"$nulls":8},"Sistema Municipal para el Desarrollo Integral de la Familia de Tenabo",114,"MUNICIPIOS"]
[{"$nulls":8},"Junta Municipal de Tinún ",115,"MUNICIPIOS"]
[{"$nulls":8},"Municipio de Seybaplaya",116,"MUNICIPIOS"]
[{"$nulls":8},"Municipio de Dzibalché",117,"MUNICIPIOS"]
[{"$nulls":8},"Comisión de Derechos Humanos del Estado de Campeche",118,"ÓRGANOS AUTÓNOMOS"]
[{"$nulls":8},"Comisión de Transparencia y Acceso a la Información Pública del Estado de Campeche",119,"ÓRGANOS AUTÓNOMOS"]
[{"$nulls":8},"Fiscalía Especializada en Combate a la Corrupción del Estado de Campeche",120,"ÓRGANOS AUTÓNOMOS"]
[{"$nulls":8},"Instituto Electoral del Estado de Campeche",121,"ÓRGANOS AUTÓNOMOS"]
[{"$nulls":8},"Tribunal de Justicia Administrativa del Estado de Campeche",122,"ÓRGANOS AUTÓNOMOS"]
[{"$nulls":8},"Tribunal Electoral del Estado de Campeche",123,"ÓRGANOS AUTÓNOMOS"]
[{"$nulls":8},"Fideicomiso de Inversión del Impuesto del 2% sobre Nóminas del Estado de Campeche",124,"FIDEICOMISOS Y FONDOS PÚBLICOS "]
[{"$nulls":8},"Fondo Campeche",125,"FIDEICOMISOS Y FONDOS PÚBLICOS "]
[{"$nulls":8},"Fondo Estatal de Fomento Industrial del Estado de Campeche",126,"FIDEICOMISOS Y FONDOS PÚBLICOS "]
[{"$nulls":8},"Junta Local de Conciliación y Arbitraje del Estado de Campeche",127,"AUTORIDADES ADMINISTRATIVAS Y JURISDICCIONALES EN MATERIA LABORAL"]
[{"$nulls":8},"Instituto Campechano",128,"INSTITUCIONES DE EDUCACIÓN SUPERIOR PÚBLICAS DOTADAS DE AUTONOMÍA"]
[{"$nulls":8},"Universidad Autónoma de Campeche",129,"INSTITUCIONES DE EDUCACIÓN SUPERIOR PÚBLICAS DOTADAS DE AUTONOMÍA"]
[{"$nulls":8},"Universidad Autónoma del Carmen",130,"INSTITUCIONES DE EDUCACIÓN SUPERIOR PÚBLICAS DOTADAS DE AUTONOMÍA"]
[{"$nulls":8},"Morena",131,"PARTIDOS POLÍTICOS"]
[{"$nulls":8},"Movimiento Ciudadano",132,"PARTIDOS POLÍTICOS"]
[{"$nulls":8},"Partido Acción Nacional ",133,"PARTIDOS POLÍTICOS"]
[{"$nulls":8},"Partido de la Revolución Democrática",134,"PARTIDOS POLÍTICOS"]
[{"$nulls":8},"Partido del Trabajo ",135,"PARTIDOS POLÍTICOS"]
[{"$nulls":8},"Partido Revolucionario Institucional",136,"PARTIDOS POLÍTICOS"]
[{"$nulls":8},"Partido Verde Ecologista de México",137,"PARTIDOS POLÍTICOS"]
[{"$nulls":8},"Partido Encuentro Solidario",138,"PARTIDOS POLÍTICOS"]
[{"$nulls":8},"Partido Redes Sociales Progresistas",139,"PARTIDOS POLÍTICOS"]
[{"$nulls":8},"Partido Fuerza por México",140,"PARTIDOS POLÍTICOS"]
[{"$nulls":8},"Sindicato Único de Personal Académico de la Universidad Autónoma de Campeche",141,"SINDICATOS"]
[{"$nulls":8},"Sindicato Único de Personal Docente del Colegio de Educación Profesional Técnica del Estado de Campeche",142,"SINDICATOS"]
[{"$nulls":8},"Sindicato Único de Trabajadores Académicos, Administrativos y Manuales del Instituto Campechano",143,"SINDICATOS"]
[{"$nulls":8},"Sindicato Único de Trabajadores Administrativos, de Intendencia y Similares de la Universidad Autónoma de Campeche",144,"SINDICATOS"]
[{"$nulls":8},"Sindicato Único de Trabajadores al Servicio de los Poderes, Municipios e Instituciones Descentralizadas del Estado de Campeche",145,"SINDICATOS"]
[{"$nulls":8},"Sindicato Único de Trabajadores al Servicio del Gobierno Municipal",146,"SINDICATOS"]
[{"$nulls":8},"Sindicato Único de Trabajadores de la Universidad Tecnológica de Campeche",147,"SINDICATOS"]
[{"$nulls":8},"Sindicato Único de Trabajadores del Colegio de Bachilleres del Estado de Campeche",148,"SINDICATOS"]
[{"$nulls":8},"Sindicato Único de Trabajadores del Colegio de Estudios Científicos y Tecnológicos del Estado de Campeche",149,"SINDICATOS"]
[{"$nulls":8},"Sindicato Único del Personal Académico, Administrativo, Manual y Apoyo del Colegio de Estudios Científicos y Tecnológicos del Estado de Campeche",150,"SINDICATOS"]
[{"$nulls":8},"Sindicato Único de Trabajadores de la Universidad Autónoma del Carmen",151,"SINDICATOS"]

{"sheet":"Resultados","index":1,"n_rows":45,"n_cols":9,"rows_kept":45,"merged":[[0,3,0,7],[1,3,1,7],[4,2,4,4],[4,6,4,7],[6,2,6,4],[6,6,6,7],[8,2,8,7],[10,5,10,6],[14,2,14,3],[15,2,15,3],[36,1,36,4],[37,1,37,4],[38,1,38,4],[39,1,39,4],[40,1,40,4],[41,1,41,4],[42,1,42,4],[43,1,43,4],[44,1,44,4]]}
[{"$nulls":3},"VERIFICACIÓN VINCULANTE  2021"]
[{"$nulls":3},{"$f":"IF(Aplicabilidad!E2=\"\",\"\",Aplicabilidad!E2)","v":"Consejería Jurídica"}]
[]
[]
[null,null,"Fecha de Inicio de la Verificación:",{"$nulls":3},"Fecha de Término de la verificación"]
[]
[null,null,"2021-07-07",{"$nulls":3},"2021-07-08"]
[]
[null,null,"INDICE GLOBAL DE CUMPLIMIENTO"]
[]
[{"$nulls":4},{"$f":"CONCATENATE(\"Promedio parcial Art. \",C16,\":\")","v":"Promedio parcial Art. 74:"},{"$f":"AVERAGE(G16:H16)","v":{"v":0.965316859066859,"d":"96.53%"}}]
[]
[]
[]
[null,null,"Art. / Fracción",null,"Aplica",null,"Crit. Sust","Crit Adj."]
[null,null,74,null,"SI",null,{"$f":"IF(ISERROR(AVERAGE('Art 74_I'!E10,'Art 74_II'!E10,'Art 74_III'!E10,'Art 74_IV'!E10,'Art 74_V'!E10,'Art 74_VI'!E10,'Art 74_VII'!E10,'Art 74_VIII'!E10,'Art 74_IX'!E10,'Art 74_X'!E10,'Art 74_XI'!E10,'Art 74_XII'!E10,'Art 74_XIII'!E10,'Art 74_XIV'!E10,'Art 74_XV'!E10,'Art 74_XVI'!E10,'Art 74_XVII'!E10,'Art 74_XVIII'!E10,'Art 74_XIX'!E10,'Art 74_XX'!E10,'Art 74_XXI'!E10,'Art 74_XXII'!E10,'Art 74_XXIII'!E10,'Art 74_XXIV'!E10,'Art 74_XXV'!E10,'Art 74_XXVI'!E10,'Art 74_XXVII'!E10,'Art 74_XXVIII'!E10,'Art 74_XXIX'!E10,'Art 74_XXX'!E10,'Art 74_XXXI'!E10,'Art 74_XXXII'!E10,'Art 74_XXXIII'!E10,'Art 74_XXXIV'!E10,'Art 74_XXXV'!E10,'Art 74_XXXVI'!E10,'Art 74_XXXVII'!E10,'Art 74_XXXVIII'!E10,'Art 74_XXXIX'!E10,'Art 74_XL'!E10,'Art 74_XLI'!E10,'Art 74_XLII'!E10,'Art 74_XLIII'!E10,'Art 74_XLIV'!E10,'Art 74_XLV'!E10,'Art 74_XLVI'!E10,'Art 74_XLVII'!E10,'Art 74_XLVIII'!E10,'Art 74_Ult.P'!E10)),\"\", AVERAGE('Art 74_I'!E10,'Art 74_II'!E10,'Art 74_III'!E10,'Art 74_IV'!E10,'Art 74_V'!E10,'Art 74_VI'!E10,'Art 74_VII'!E10,'Art 74_VIII'!E10,'Art 74_IX'!E10,'Art 74_X'!E10,'Art 74_XI'!E10,'Art 74_XII'!E10,'Art 74_XIII'!E10,'Art 74_XIV'!E10,'Art 74_XV'!E10,'Art 74_XVI'!E10,'Art 74_XVII'!E10,'Art 74_XVIII'!E10,'Art 74_XIX'!E10,'Art 74_XX'!E10,'Art 74_XXI'!E10,'Art 74_XXII'!E10,'Art 74_XXIII'!E10,'Art 74_XXIV'!E10,'Art 74_XXV'!E10,'Art 74_XXVI'!E10,'Art 74_XXVII'!E10,'Art 74_XXVIII'!E10,'Art 74_XXIX'!E10,'Art 74_XXX'!E10,'Art 74_XXXI'!E10,'Art 74_XXXII'!E10,'Art 74_XXXIII'!E10,'Art 74_XXXIV'!E10,'Art 74_XXXV'!E10,'Art 74_XXXVI'!E10,'Art 74_XXXVII'!E10,'Art 74_XXXVIII'!E10,'Art 74_XXXIX'!E10,'Art 74_XL'!E10,'Art 74_XLI'!E10,'Art 74_XLII'!E10,'Art 74_XLIII'!E10,'Art 74_XLIV'!E10,'Art 74_XLV'!E10,'Art 74_XLVI'!E10,'Art 74_XLVII'!E10,'Art 74_XLVIII'!E10,'Art 74_Ult.P'!E10))","v":{"v":0.9356842231842233,"d":"93.57%"}},{"$f":"IF(ISERROR(AVERAGE('Art 74_I'!E11,'Art 74_II'!E11,'Art 74_III'!E11,'Art 74_IV'!E11,'Art 74_V'!E11,'Art 74_VI'!E11,'Art 74_VII'!E11,'Art 74_VIII'!E11,'Art 74_IX'!E11,'Art 74_X'!E11,'Art 74_XI'!E11,'Art 74_XII'!E11,'Art 74_XIII'!E11,'Art 74_XIV'!E11,'Art 74_XV'!E11,'Art 74_XVI'!E11,'Art 74_XVII'!E11,'Art 74_XVIII'!E11,'Art 74_XIX'!E11,'Art 74_XX'!E11,'Art 74_XXI'!E11,'Art 74_XXII'!E11,'Art 74_XXIII'!E11,'Art 74_XXIV'!E11,'Art 74_XXV'!E11,'Art 74_XXVI'!E11,'Art 74_XXVII'!E11,'Art 74_XXVIII'!E11,'Art 74_XXIX'!E11,'Art 74_XXX'!E11,'Art 74_XXXI'!E11,'Art 74_XXXII'!E11,'Art 74_XXXIII'!E11,'Art 74_XXXIV'!E11,'Art 74_XXXV'!E11,'Art 74_XXXVI'!E11,'Art 74_XXXVII'!E11,'Art 74_XXXVIII'!E11,'Art 74_XXXIX'!E11,'Art 74_XL'!E11,'Art 74_XLI'!E11,'Art 74_XLII'!E11,'Art 74_XLIII'!E11,'Art 74_XLIV'!E11,'Art 74_XLV'!E11,'Art 74_XLVI'!E11,'Art 74_XLVII'!E11,'Art 74_XLVIII'!E11,'Art 74_Ult.P'!E11)),\"\", AVERAGE('Art 74_I'!E11,'Art 74_II'!E11,'Art 74_III'!E11,'Art 74_IV'!E11,'Art 74_V'!E11,'Art 74_VI'!E11,'Art 74_VII'!E11,'Art 74_VIII'!E11,'Art 74_IX'!E11,'Art 74_X'!E11,'Art 74_XI'!E11,'Art 74_XII'!E11,'Art 74_XIII'!E11,'Art 74_XIV'!E11,'Art 74_XV'!E11,'Art 74_XVI'!E11,'Art 74_XVII'!E11,'Art 74_XVIII'!E11,'Art 74_XIX'!E11,'Art 74_XX'!E11,'Art 74_XXI'!E11,'Art 74_XXII'!E11,'Art 74_XXIII'!E11,'Art 74_XXIV'!E11,'Art 74_XXV'!E11,'Art 74_XXVI'!E11,'Art 74_XXVII'!E11,'Art 74_XXVIII'!E11,'Art 74_XXIX'!E11,'Art 74_XXX'!E11,'Art 74_XXXI'!E11,'Art 74_XXXII'!E11,'Art 74_XXXIII'!E11,'Art 74_XXXIV'!E11,'Art 74_XXXV'!E11,'Art 74_XXXVI'!E11,'Art 74_XXXVII'!E11,'Art 74_XXXVIII'!E11,'Art 74_XXXIX'!E11,'Art 74_XL'!E11,'Art 74_XLI'!E11,'Art 74_XLII'!E11,'Art 74_XLIII'!E11,'Art 74_XLIV'!E11,'Art 74_XLV'!E11,'Art 74_XLVI'!E11,'Art 74_XLVII'!E11,'Art 74_XLVIII'!E11,'Art 74_Ult.P'!E11))","v":{"v":0.9949494949494949,"d":"99.49%"}}]
{"$rows_empty":7}
[null,{"$f":"CONCATENATE(\"Verificador: \",Aplicabilidad!E7)","v":"Verificador: Erick Raymundo Zabala Pérez"},{"$nulls":6},{"$f":"CONCATENATE(\"Coordinador: \",Aplicabilidad!J7)","v":"Coordinador: Gabriela Ortiz Gutierrez"}]
[]
[]
[{"$nulls":6},70,{"$f":"IF(#REF!=\"NA\",\"NA\",#REF!)","v":{"$error":"#REF!"}}]
[{"$nulls":6},71,{"$f":"IF(AND(#REF!=\"NA\",#REF!=\"NA\"),\"NA\",AVERAGE(#REF!))","v":{"$error":"#REF!"}}]
[{"$nulls":6},72,{"$f":"IF(#REF!=\"NA\",\"NA\",#REF!)","v":{"$error":"#REF!"}}]
[{"$nulls":6},73,{"$f":"IF(#REF!=\"NA\",\"NA\",#REF!)","v":{"$error":"#REF!"}}]
[null,null,"IOC","IOE","IOA","Grupo de cálculo para ponderación",74,{"$f":"IF(AND(#REF!=\"NA\",#REF!=\"NA\",#REF!=\"NA\"),\"NA\",AVERAGE(#REF!))","v":{"$error":"#REF!"}}]
[null,null,{"$f":"IF(H27=\"NA\",\"NA\",H27)","v":{"$error":"#REF!"}},{"$f":"IF(AND(H28=\"NA\",H29=\"NA\",H30=\"NA\",H31=\"NA\",H32=\"NA\",H33=\"NA\",H34=\"NA\",H35=\"NA\",H36=\"NA\"),\"NA\",AVERAGE(H28:H36))","v":{"$error":"#REF!"}},{"$f":"IF(AND(H37=\"NA\",H38=\"NA\",H39=\"NA\"),\"NA\",AVERAGE(H37:H39))","v":{"$error":"#REF!"}},{"$f":"IF(AND(C32=\"NA\",D32=\"NA\",E32=\"NA\"),8,IF(AND(C32=\"NA\",D32=\"NA\"),7,IF(AND(C32=\"NA\",E32=\"NA\"),6,IF(AND(D32=\"NA\",E32=\"NA\"),5,IF(E32=\"NA\",4,IF(D32=\"NA\",3,IF(C32=\"NA\",2,1)))))))","v":{"$error":"#REF!"}},75,{"$f":"IF(#REF!=\"NA\",\"NA\",#REF!)","v":{"$error":"#REF!"}}]
["R. POND",null,{"$error":"#REF!"},{"$error":"#REF!"},{"$error":"#REF!"},null,76,{"$f":"IF(#REF!=\"NA\",\"NA\",#REF!)","v":{"$error":"#REF!"}}]
["RESULT",null,{"$f":"IF(AND(C33=\"NA\",D33=\"NA\",E33=\"NA\"),\"NA\",SUM(C33:E33))","v":{"$error":"#REF!"}},{"$nulls":3},77,{"$f":"IF(#REF!=\"NA\",\"NA\",#REF!)","v":{"$error":"#REF!"}}]
[{"$nulls":6},78,{"$f":"IF(#REF!=\"NA\",\"NA\",#REF!)","v":{"$error":"#REF!"}}]
[{"$nulls":6},79,{"$f":"IF(#REF!=\"NA\",\"NA\",#REF!)","v":{"$error":"#REF!"}}]
["GRUPO","EXPLICACIÓN",{"$nulls":4},80,{"$f":"IF(#REF!=\"NA\",\"NA\",#REF!)","v":{"$error":"#REF!"}}]
[1,"Aplican los tres componentes ",{"$nulls":4},81,{"$f":"IF(#REF!=\"NA\",\"NA\",#REF!)","v":{"$error":"#REF!"}}]
[2,"Aplica solo segundo y tercer componente",{"$nulls":4},82,{"$f":"IF(#REF!=\"NA\",\"NA\",#REF!)","v":{"$error":"#REF!"}}]
[3,"Aplica solo primer y tercer componente"]
[4,"Aplica solo primer y segundo componente"]
[5,"Solo aplica primer componente"]
[6,"Solo aplica segundo componente"]
[7,"Solo aplica el tercer componente"]
[8,"Ningún componente aplica"]

{"sheet":"Aplicabilidad","index":2,"n_rows":67,"n_cols":14,"rows_kept":67,"merged":[[1,4,1,9],[3,3,3,4],[4,2,4,7]]}
[{"$nulls":13},"SI"]
[{"$nulls":3},{"$f":"IF(ISERROR(VLOOKUP(E2,'Cat. Res'!I:K,2,FALSE)),\"\", VLOOKUP(E2,'Cat. Res'!I:K,2,FALSE))","v":3},"Consejería Jurídica",{"$nulls":5},{"$f":"IF(ISERROR(CONCATENATE(\"Clasificación:\",CHAR(10),VLOOKUP(E2,'Cat. Res'!I:K,3,FALSE))),\"\",CONCATENATE(\"Clasificación:\",CHAR(10),VLOOKUP(E2,'Cat. Res'!I:K,3,FALSE)))","v":"Clasificación:\nPODER EJECUTIVO"},null,null,"NO"]
[]
[]
[null,null,"Aplicación de Obligaciones de la Ley General"]
[]
[{"$nulls":3},"Responsable de la verificación","Erick Raymundo Zabala Pérez",{"$nulls":3},"Coordinador de la verificación","Gabriela Ortiz Gutierrez"]
[]
[{"$nulls":3},"No de obligaciones Aplicables",{"$f":"IF(E2=\"\",\"Seleccione el S. O. a verificar\",SUM(H12:H67))","v":22}]
[]
[null,null,"Artículo","Fracción","Inciso","Obligación","Aplicación",null,null,"Fecha de inico de descarga del Respaldo de la Información","Fecha de término de descarga del Respaldo de la Información"]
[null,null,74,"I",null,"Art 74_I","SI",{"$f":"IF(G12=\"si\",1,\"\")","v":1},null,"2021-07-06","2021-07-06"]
[null,null,74,"II",null,"Art 74_II","SI",{"$f":"IF(G13=\"si\",1,\"\")","v":1},null,"2021-07-06","2021-07-06"]
[null,null,74,"III",null,"Art 74_III","SI",1,null,"2021-07-06","2021-07-06"]
[null,null,74,"IV",null,"Art 74_IV",null,""]
[null,null,74,"V",null,"Art 74_V",null,""]
[null,null,74,"VI",null,"Art 74_VI",null,""]
[null,null,74,"VII",null,"Art 74_VII","SI",1,null,"2021-07-06","2021-07-06"]
[null,null,74,"VIII",null,"Art 74_VIII","SI",1,null,"2021-07-06","2021-07-06"]
[null,null,74,"IX",null,"Art 74_IX","SI",1,null,"2021-07-06","2021-07-06"]
[null,null,74,"X",null,"Art 74_X","SI",1,null,"2021-07-06","2021-07-06"]
[null,null,74,"XI",null,"Art 74_XI","SI",1,null,"2021-07-06","2021-07-06"]
[null,null,74,"XII",null,"Art 74_XII","NO",""]
[null,null,74,"XIII",null,"Art 74_XIII",null,""]
[null,null,74,"XIV",null,"Art 74_XIV","NO",""]
[null,null,74,"XV",null,"Art 74_XV","NO",""]
[null,null,74,"XVI",null,"Art 74_XVI",null,""]
[null,null,74,"XVII",null,"Art 74_XVII","SI",1,null,"2021-07-06","2021-07-06"]
[null,null,74,"XVIII",null,"Art 74_XVIII","SI",1,null,"2021-07-06","2021-07-06"]
[null,null,74,"XIX",null,"Art 74_XIX","SI",1,null,"2021-07-06","2021-07-06"]
[null,null,74,"XX",null,"Art 74_XX","SI",1,null,"2021-07-06","2021-07-06"]
[null,null,74,"XXI",null,"Art 74_XXI","SI",1,null,"2021-07-06","2021-07-06"]
[null,null,74,"XXII",null,"Art 74_XXII",null,""]
[null,null,74,"XXIII",null,"Art 74_XXIII",null,""]
[null,null,74,"XXIV",null,"Art 74_XXIV","SI",1,null,"2021-07-06","2021-07-06"]
[null,null,74,"XXV",null,"Art 74_XXV",null,""]
[null,null,74,"XXVI",null,"Art 74_XXVI",null,""]
[null,null,74,"XXVII",null,"Art 74_XXVII","NO",""]
[null,null,74,"XXVIII",null,"Art 74_XXVIII","NO",""]
[null,null,74,"XXIX",null,"Art 74_XXIX","SI",1,null,"2021-07-06","2021-07-06"]
[null,null,74,"XXX",null,"Art 74_XXX",null,""]
[null,null,74,"XXXI",null,"Art 74_XXXI","SI",1,null,"2021-07-06","2021-07-06"]
[null,null,74,"XXXII",null,"Art 74_XXXII","NO",""]
[null,null,74,"XXXIII",null,"Art 74_XXXIII",null,""]
[null,null,74,"XXXIV",null,"Art 74_XXXIV","SI",1,null,"2021-07-06","2021-07-06"]
[null,null,74,"XXXV",null,"Art 74_XXXV",null,""]
[null,null,74,"XXXVI",null,"Art 74_XXXVI",null,""]
[null,null,74,"XXXVII",null,"Art 74_XXXVII",null,""]
[null,null,74,"XXXVIII",null,"Art 74_XXXVIII","NO",""]
[null,null,74,"XXXIX",null,"Art 74_XXXIX","SI",1,null,"2021-07-06","2021-07-06"]
[null,null,74,"XL",null,"Art 74_XL","SI",1,null,"2021-07-06","2021-07-06"]
[null,null,74,"XLI",null,"Art 74_XLI",null,""]
[null,null,74,"XLII",null,"Art 74_XLII",null,""]
[null,null,74,"XLIII",null,"Art 74_XLIII","NO",""]
[null,null,74,"XLIV",null,"Art 74_XLIV",null,""]
[null,null,74,"XLV",null,"Art 74_XLV","SI",1,null,"2021-07-06","2021-07-06"]
[null,null,74,"XLVI",null,"Art 74_XLVI",null,""]
[null,null,74,"XLVII",null,"Art 74_XLVII",null,""]
[null,null,74,"XLVIII",null,"Art 74_XLVIII","SI",1,null,"2021-07-06","2021-07-06"]
[null,null,74,"Ult.P",null,"Art 74_Ult.P","SI",1,null,"2021-07-06","2021-07-06"]
[null,null,75,"I",null,"Art 75_I",null,""]
[null,null,75,"II",null,"Art 75_II",null,""]
[null,null,75,"III",null,"Art 75_III",null,""]
[null,null,75,"IV",null,"Art 75_IV",null,""]
[null,null,75,"V",null,"Art 75_V",null,""]
[null,null,71,"I","F","Art 75_I_F",null,""]
[null,null,75,"VI",null,"Art 75_VI",null,""]

{"sheet":"Art 74_I","index":3,"n_rows":49,"n_cols":7,"rows_kept":49,"merged":[[0,2,0,6],[4,1,4,7],[14,4,14,6]]}
[null,null,{"$f":"IF(Aplicabilidad!E2=\"\",\"\",Aplicabilidad!E2)","v":"Consejería Jurídica"}]
[]
[null,"Códigos de valoración : Cumplió totalmente = 1; Cumplió parcialmente = 0.5; No cumplió = 0; Justificado = Justificado"]
[]
[null,"Art. 74 - Fracción I. Marco Normativo"]
[]
[null,null,"Fecha de Inicio de la Verificación:",{"$nulls":3},"Fecha de Término de la verificación"]
[null,null,{"$f":"IF(Resultados!$C$7=\"\",\"\",Resultados!$C$7)","v":"2021-07-07"},{"$nulls":3},{"$f":"IF(Resultados!G7=\"\",\"\",Resultados!G7)","v":"2021-07-08"}]
[]
[null,null,"Criterios Sustantivos",null,{"$f":"IF(Aplicabilidad!G12<>\"SI\",\"NA\",(+SUM(E19:E25))/(+SUM(D19:D25)))","v":{"v":1,"d":"100%"}}]
[null,null,"Criterios Adjetivos",null,{"$f":"IF(Aplicabilidad!G12<>\"SI\",\"NA\",(+SUM(E30:E38))/(+SUM(D30:D38)))","v":{"v":1,"d":"100%"}}]
[null,null,"Obligación",null,{"$f":"IF(Aplicabilidad!G12<>\"SI\",\"NA\",E10*0.6+E11*0.4)","v":{"v":1,"d":"100.00%"}}]
[]
[]
[]
[null,null,"Criterios Sustantivos de contenido \nLTG 2018 - LTG 2020 (DOF 28/12/20) ",{"$f":"COUNTA(F19:F38)","v":1}]
[]
[null,null,"Criterio",null,"Valoración","Tipo","Observaciones, Recomendaciones y/o Requerimientos"]
[null,null,"Criterio 1. Ejercicio",{"$f":"IF(E19=\"Justificado\",0,1)","v":1},1]
[null,null,"Criterio 2. Periodo que se informa (fecha de inicio y fecha de término con el formato día/mes/año)",{"$f":"IF(E20=\"Justificado\",0,1)","v":1},1]
[null,null,"Criterio 3. Tipo de normatividad (catálogo): Constitución Política de los Estados Unidos Mexicanos/Tratado internacional/Constitución Política de la entidad federativa/Estatuto/Ley General/Ley Federal/Ley Orgánica/Ley local/Ley Reglamentaria/Código/Reglamento/Decreto/Manual/Reglas de operación/ Criterios/Política/Condiciones/Norma/Bando/Resolución/Lineamientos/Circular/Acuerdo/Convenio/Contrato/Estatuto sindical/Estatuto Universitario/Estatuto de personas morales/Memorando de entendimiento/Otro",1,1]
[null,null,"Criterio 4. Denominación de la norma que se reporta",1,1]
[null,null,"Criterio 5. Fecha de publicación en el DOF u otro medio oficial o institucional expresada en el formato día/mes/año. En su caso, se incluirá la fecha de publicación y/o fecha de firma o aprobación y en el caso de Tratados Internacionales se registrará la fecha de publicación y/o fecha de ratificación con el formato día/mes/año",1,1]
[null,null,"Criterio 6. Fecha de última modificación, en su caso, expresada en el formato día/mes/año. De no existir modificación, se repetirá la fecha de publicación ",{"$f":"IF(E24=\"Justificado\",0,1)","v":1},1]
[null,null,"Criterio 7. Hipervínculo al documento completo de cada norma",{"$f":"IF(E25=\"Justificado\",0,1)","v":1},1]
[]
[null,null,"Criterios Adjetivos LTG 2018 - LTG 2020 (DOF 28/12/20) "]
[]
[null,null,"Criterio",null,"Valoración","Tipo","Observaciones, Recomendaciones y/o Requerimientos"]
[null,null,"Criterio 8. Periodo de actualización de la información: trimestral. Únicamente cuando se expida alguna reforma, adición, derogación, abrogación o se realice cualquier tipo de modificación al marco normativo aplicable al sujeto obligado, la información deberá publicarse y/o actualizarse en un plazo no mayor a 15 días hábiles a partir de su publicación en el DOF, Periódico o Gaceta Oficial, o acuerdo de aprobación en el caso de normas publicadas por medios distintos, como el sitio de Internet",{"$f":"IF(E30=\"Justificado\",0,1)","v":1},1]
[null,null,"Criterio 9. La información publicada deberá estar actualizada al periodo que corresponde, de acuerdo con la Tabla de actualización y conservación de la información",1,1]
[null,null,"Criterio 10. Conservar en el sitio de Internet: información vigente",1,1]
[null,null,"Criterio 11. Área(s) responsable(s) que genera(n), posee(n), publica(n) y actualiza(n) la información.",1,1]
[null,null,"Criterio 12. Fecha de actualización de la información publicada con el formato día/mes/año ",1,1]
[null,null,"Criterio 13. Fecha de validación de la información publicada con el formato día/mes/año ",1,1]
[null,null,"Criterio 14. Nota. Este criterio se cumple en caso de que sea necesario que el sujeto obligado incluya alguna aclaración relativa a la información publicada y/o explicación por la falta de información",1,1]
[null,null,"Criterio 15. La información publicada se organiza mediante el formato 1, en el que se incluyen todos los campos especificados en los criterios sustantivos de contenido",1,1]
[null,null,"Criterio 16. El soporte de la información permite su reutilización",1,1]
{"$rows_empty":7}
[{"$nulls":3},2017,2018]
[null,null,"CS","NA",{"$f":"IF(Aplicabilidad!G12<>\"SI\",\"NA\",SUM(E19:E25)/SUM(D19:D25))","v":{"v":1,"d":"100.00%"}}]
[null,null,"CA","NA",{"$f":"IF(Aplicabilidad!G12<>\"SI\",\"NA\",SUM(E30:E38)/SUM(D30:D38))","v":{"v":1,"d":"100.00%"}}]
[null,null,"OBLIGACIÓN","NA",{"$f":"IF(Aplicabilidad!G12<>\"SI\",\"NA\",E47*0.6+E48*0.4)","v":{"v":1,"d":"100.00%"}}]

{"sheet":"Art 74_II","index":4,"n_rows":56,"n_cols":7,"rows_kept":56,"merged":[[0,2,0,6],[4,1,4,7],[14,4,14,6]]}
[null,null,{"$f":"IF(Aplicabilidad!E2=\"\",\"\",Aplicabilidad!E2)","v":"Consejería Jurídica"}]
[]
[null,"Códigos de valoración : Cumplió totalmente = 1; Cumplió parcialmente = 0.5; No cumplió = 0; Justificado = Justificado"]
[]
[null,"Art. 74 - Fracción II. Estructura orgánica"]
[]
[null,null,"Fecha de Inicio de la Verificación:",{"$nulls":3},"Fecha de Término de la verificación"]
[null,null,{"$f":"IF(Resultados!$C$7=\"\",\"\",Resultados!$C$7)","v":"2021-07-07"},"2018-05-25",null,null,{"$f":"IF(Resultados!G7=\"\",\"\",Resultados!G7)","v":"2021-07-08"}]
[]
[null,null,"Criterios Sustantivos",null,{"$f":"IF(Aplicabilidad!G13<>\"SI\",\"NA\",(+SUM(E19:E32))/(+SUM(D19:D32)))","v":{"v":1,"d":"100%"}}]
[null,null,"Criterios Adjetivos",null,{"$f":"IF(Aplicabilidad!G13<>\"SI\",\"NA\",(+SUM(E37:E45))/(+SUM(D37:D45)))","v":{"v":1,"d":"100%"}}]
[null,null,"Obligación",null,{"$f":"IF(Aplicabilidad!G13<>\"SI\",\"NA\",E10*0.6+E11*0.4)","v":{"v":1,"d":"100.00%"}}]
[]
[]
[]
[null,null,"Criterios Sustantivos de contenido \nLTG 2018 - LTG 2020 (DOF 28/12/20) ",{"$f":"COUNTA(F19:F45)","v":1}]
[]
[null,null,"Criterio",null,"Valoración","Tipo","Observaciones, Recomendaciones y/o Requerimientos"]
[null,null,"Criterio 1. Ejercicio",{"$f":"IF(E19=\"Justificado\",0,1)","v":1},1]
[null,null,"Criterio 2. Periodo que se informa (fecha de inicio y fecha de término con el formato día/mes/año)",{"$f":"IF(E20=\"Justificado\",0,1)","v":1},1]
[null,null,"Criterio 3. Denominación del área (de acuerdo con el catálogo que en su caso regule la actividad del sujeto obligado)",1,1]
[null,null,"Criterio 4. Denominación del puesto (de acuerdo con el catálogo que en su caso regule la actividad del sujeto obligado). La información deberá estar ordenada de tal forma que sea posible visualizar los niveles de jerarquía y sus relaciones de dependencia",1,1]
[null,null,"Criterio 5. Denominación del cargo (de conformidad con nombramiento otorgado)",1,1]
[null,null,"Criterio 6. Área de adscripción inmediata superior",1,1]
[null,null,"Criterio 7. Por cada puesto y/o cargo de la estructura se deberá especificar la\ndenominación de la norma que establece sus atribuciones, responsabilidades y/o funciones, según sea el caso y el fundamento legal (artículo y/o fracción) que sustenta el puesto. (Criterio Modificado DOF 28/12/2020)",1,1]
[{"$nulls":3},0,"Justificado"]
[null,null,"Criterio 8. Por cada puesto o cargo deben registrarse las atribuciones, responsabilidades y/o funciones, según sea el caso",1,1]
[null,null,"Criterio 9. Hipervínculo al perfil y/o requerimientos del puesto o cargo, en caso de existir de acuerdo con la normatividad que aplique",0,"Justificado"]
[null,null,"Criterio 10. Por cada área del sujeto obligado se debe incluir, en su caso, el número total de prestadores de servicios profesionales o miembros que integren el sujeto obligado de conformidad con las disposiciones aplicables (por ejemplo, en puestos honoríficos)",1,1]
[null,null,"Criterio 11. Ejercicio",1,1]
[null,null,"Criterio 12. Periodo que se informa (fecha de inicio y fecha de término con el formato día/mes/año)",{"$f":"IF(E31=\"Justificado\",0,1)","v":1},1]
[null,null,"Criterio 13. Hipervínculo al organigrama completo del sujeto obligado (forma gráfica de la estructura orgánica), acorde a su normatividad, el cual deberá contener el número de dictamen o similar",{"$f":"IF(E32=\"Justificado\",0,1)","v":1},1]
[]
[null,null,"Criterios Adjetivos LTG 2018 - LTG 2020 (DOF 28/12/20) "]
[]
[null,null,"Criterio",null,"Valoración","Tipo","Observaciones, Recomendaciones y/o Requerimientos"]
[null,null,"Criterio 15. Periodo de actualización de la información: trimestral. En su caso, 15 días hábiles después de la aprobación de alguna modificación a la estructura orgánica",{"$f":"IF(E37=\"Justificado\",0,1)","v":1},1]
[null,null,"Criterio 16. La información publicada deberá estar actualizada al periodo que corresponde, de acuerdo con la Tabla de actualización y conservación de la información",1,1]
[null,null,"Criterio 17.Conservar en el sitio de Internet: información vigente",1,1]
[null,null,"Criterio 18. Área(s) responsable(s) genera(n), posee(n), publica(n) y actualiza(n) la información.",1,1]
[null,null,"Criterio 19. Fecha de actualización de la información publicada con el formato día/mes/año  ",1,1]
[null,null,"Criterio 20. Fecha de validación de la información publicada con el formato día/mes/año ",1,1]
[null,null,"Criterio 21. Nota. Este criterio se cumple en caso de que sea necesario que el sujeto obligado incluya alguna aclaración relativa a la información publicada y/o explicación por la falta de información ",1,1]
[null,null,"Criterio 22. La información publicada se organiza mediante los formatos 2ª y 2b, en el que se incluyen todos los campos especificados en los criterios sustantivos de contenido",1,1]
[null,null,"Criterio 23. El soporte de la información permite su reutilización",1,1]
{"$rows_empty":7}
[{"$nulls":3},2017,2018]
[null,null,"CS","NA",{"$f":"IF(Aplicabilidad!G13<>\"SI\",\"NA\",SUM(E19:E32)/SUM(D19:D32))","v":{"v":1,"d":"100.00%"}}]
[null,null,"CA","NA",{"$f":"IF(Aplicabilidad!G13<>\"SI\",\"NA\",SUM(E37:E45)/SUM(D37:D45))","v":{"v":1,"d":"100.00%"}}]
[null,null,"OBLIGACIÓN","NA",{"$f":"IF(Aplicabilidad!G13<>\"SI\",\"NA\",E54*0.6+E55*0.4)","v":{"v":1,"d":"100.00%"}}]

{"sheet":"Art 74_III","index":5,"n_rows":48,"n_cols":7,"rows_kept":48,"merged":[[0,2,0,6],[4,1,4,7],[14,4,14,6]]}
[null,null,{"$f":"IF(Aplicabilidad!E2=\"\",\"\",Aplicabilidad!E2)","v":"Consejería Jurídica"}]
[]
[null,"Códigos de valoración : Cumplió totalmente = 1; Cumplió parcialmente = 0.5; No cumplió = 0; Justificado = Justificado"]
[]
[null,"Art. 74 - Fracción III. Facultades de cada Área"]
[]
[null,null,"Fecha de Inicio de la Verificación:",{"$nulls":3},"Fecha de Término de la verificación"]
[null,null,{"$f":"IF(Resultados!$C$7=\"\",\"\",Resultados!$C$7)","v":"2021-07-07"},"2018-05-25",null,null,{"$f":"IF(Resultados!G7=\"\",\"\",Resultados!G7)","v":"2021-07-08"}]
[]
[null,null,"Criterios Sustantivos",null,{"$f":"IF(Aplicabilidad!G14<>\"SI\",\"NA\",(+SUM(E19:E24))/(+SUM(D19:D24)))","v":{"v":1,"d":"100%"}}]
[null,null,"Criterios Adjetivos",null,{"$f":"IF(Aplicabilidad!G14<>\"SI\",\"NA\",(+SUM(E29:E37))/(+SUM(D29:D37)))","v":{"v":1,"d":"100%"}}]
[null,null,"Obligación",null,{"$f":"IF(Aplicabilidad!G14<>\"SI\",\"NA\",E10*0.6+E11*0.4)","v":{"v":1,"d":"100.00%"}}]
[]
[]
[]
[null,null,"Criterios Sustantivos de contenido \nLTG 2018 - LTG 2020 (DOF 28/12/20) ",{"$f":"COUNTA(F19:F37)","v":1}]
[]
[null,null,"Criterio",null,"Valoración","Tipo","Observaciones, Recomendaciones y/o Requerimientos"]
[null,null,"Criterio 1. Ejercicio",{"$f":"IF(E19=\"Justificado\",0,1)","v":1},1]
[null,null,"Criterio 2. Periodo que se informa (fecha de inicio y fecha de término con el formato día/mes/año)",{"$f":"IF(E20=\"Justificado\",0,1)","v":1},1]
[null,null,"Criterio 3. Denominación del área (de acuerdo con el catálogo que en su caso regule la actividad del sujeto obligado)",1,1]
[null,null,"Criterio 4.Denominación de la norma en la que se establecen sus facultades y el fundamento legal (artículo y/o fracción)  (Criterio Modificado DOF 28/12/2020)",1,1]
[{"$nulls":3},{"$f":"IF(E23=\"Justificado\",0,1)","v":0},"Justificado"]
[null,null,"Criterio 5. Hipervínculo al fragmento del reglamento interior, estatuto orgánico o normatividad equivalente en el que se observen las facultades que correspondan a cada área",{"$f":"IF(E24=\"Justificado\",0,1)","v":1},1]
[]
[null,null,"Criterios Adjetivos LTG 2018 - LTG 2020 (DOF 28/12/20) "]
[]
[null,null,"Criterio",null,"Valoración","Tipo","Observaciones, Recomendaciones y/o Requerimientos"]
[null,null,"Criterio 7. Periodo de actualización de la información: trimestral. En su caso, 15 días hábiles después de alguna modificación",{"$f":"IF(E29=\"Justificado\",0,1)","v":1},1]
[null,null,"Criterio 8. La información publicada deberá estar actualizada al periodo que corresponde, de acuerdo con la Tabla de actualización y conservación de la información",1,1]
[null,null,"Criterio 9. Conservar en el sitio de Internet: información vigente",1,1]
[null,null,"Criterio 10. Área(s) responsable(s) que genera(n), posee(n), publica(n) y actualiza(n) la información",1,1]
[null,null,"Criterio 11. Fecha de actualización de la información publicada con el formato día/mes/año  ",1,1]
[null,null,"Criterio 12. Fecha de validación de la información publicada con el formato día/mes/año ",1,1]
[null,null,"Criterio 13. Nota. Este criterio se cumple en caso de que sea necesario que el sujeto obligado incluya alguna aclaración relativa a la información publicada y/o explicación por la falta de información.",1,1]
[null,null,"Criterio 14. La información publicada se organiza mediante el formato 3, en el que se incluyen todos los campos especificados en los criterios sustantivos de contenido",1,1]
[null,null,"Criterio 15. El soporte de la información permite su reutilización",1,1]
{"$rows_empty":7}
[{"$nulls":3},2017,2018]
[null,null,"CS","NA",{"$f":"IF(Aplicabilidad!G14<>\"SI\",\"NA\",SUM(E19:E24)/SUM(D19:D24))","v":{"v":1,"d":"100.00%"}}]
[null,null,"CA","NA",{"$f":"IF(Aplicabilidad!G14<>\"SI\",\"NA\",SUM(E29:E37)/SUM(D29:D37))","v":{"v":1,"d":"100.00%"}}]
[null,null,"OBLIGACIÓN","NA",{"$f":"IF(Aplicabilidad!G14<>\"SI\",\"NA\",E46*0.6+E47*0.4)","v":{"v":1,"d":"100.00%"}}]

{"sheet":"Art 74_IV","index":6,"n_rows":64,"n_cols":7,"rows_kept":64,"hidden":true,"merged":[[0,2,0,6],[4,1,4,7],[14,4,14,6],[28,4,28,6]]}
[null,null,{"$f":"IF(Aplicabilidad!E2=\"\",\"\",Aplicabilidad!E2)","v":"Consejería Jurídica"}]
[]
[null,"Códigos de valoración : Cumplió totalmente = 1; Cumplió parcialmente = 0.5; No cumplió = 0; Justificado = Justificado"]
[]
[null,"Art. 74 - Fracción IV. Metas y objetivos"]
[]
[null,null,"Fecha de Inicio de la Verificación:",{"$nulls":3},"Fecha de Término de la verificación"]
[null,null,{"$f":"IF(Resultados!$C$7=\"\",\"\",Resultados!$C$7)","v":"2021-07-07"},"2018-05-25",null,null,{"$f":"IF(Resultados!G7=\"\",\"\",Resultados!G7)","v":"2021-07-08"}]
[]
[null,null,"Criterios Sustantivos",null,{"$f":"IF(Aplicabilidad!G15<>\"SI\",\"NA\",(SUM(E19:E25)+SUM(E33:E40))/(SUM(D19:D25)+SUM(D33:D40)))","v":"NA"}]
[null,null,"Criterios Adjetivos",null,{"$f":"IF(Aplicabilidad!G15<>\"SI\",\"NA\",(SUM(E45:E53))/(SUM(D45:D53)))","v":"NA"}]
[null,null,"Obligación",null,{"$f":"IF(Aplicabilidad!G15<>\"SI\",\"NA\",E10*0.6+E11*0.4)","v":"NA"}]
[]
[]
[]
[null,null,"Criterios Sustantivos de contenido LTG 2015-2017",{"$f":"COUNTA(F19:F26)","v":0}]
[]
[null,null,"Criterio",null,"Valoración","Tipo","Observaciones, Recomendaciones y/o Requerimientos"]
[null,null,"Criterio 1. Ejercicio",{"$f":"IF(E19=\"Justificado\",0,1)","v":1}]
[null,null,"Criterio 2. Denominación del Área o Unidad responsable. Se pondrá entre paréntesis el nombre del documento que en su caso regule la actividad del sujeto obligado: reglamento interior / manual de organización / otro",{"$f":"IF(E20=\"Justificado\",0,1)","v":1}]
[null,null,"Criterio 3. Descripción breve y clara de cada objetivo",1]
[null,null,"Criterio 4. Cada objetivo deberá desplegar sus indicadores asociados",1]
[null,null,"Criterio 5. Cada indicador deberá desplegar la(s) meta(s)",1]
[null,null,"Criterio 6. Cada meta deberá especificar su unidad de medida",{"$f":"IF(E24=\"Justificado\",0,1)","v":1}]
[null,null,"Criterio 7. Hipervínculo al documento del o los programas operativos / presupuestario / sectorial / regionales / institucionales / especiales / de trabajo y/o anuales, según corresponda en un formato que permita la reutilización de la información",{"$f":"IF(E25=\"Justificado\",0,1)","v":1}]
[]
[]
[]
[]
[null,null,"Criterios Sustantivos de contenido LTG 2018",{"$f":"COUNTA(F33:F53)","v":1}]
[]
[null,null,"Criterio",null,"Valoración","Tipo","Observaciones, Recomendaciones y/o Requerimientos"]
[null,null,"Criterio 1. Ejercicio",{"$f":"IF(E33=\"Justificado\",0,1)","v":1}]
[null,null,"Criterio 2. Periodo que se informa (fecha de inicio y fecha de término con el formato día/mes/año)",{"$f":"IF(E34=\"Justificado\",0,1)","v":1}]
[null,null,"Criterio 3. Denominación del área",1]
[null,null,"Criterio 4. Descripción breve y clara de cada objetivo",1]
[null,null,"Criterio 5. Por cada objetivo, se publicarán los indicadores asociados",1]
[null,null,"Criterio 6. Cada indicador deberá señalar la(s) meta(s)",1]
[null,null,"Criterio 7. Cada meta deberá especificar su unidad de medida",{"$f":"IF(E39=\"Justificado\",0,1)","v":1}]
[null,null,"Criterio 8. Hipervínculo al documento del o los programas operativos, presupuestarios, sectoriales, regionales, institucionales, especiales, de trabajo y/o anuales; según corresponda, en un formato que permita la reutilización de la información",{"$f":"IF(E40=\"Justificado\",0,1)","v":1}]
[]
[null,null,"Criterios Adjetivos LTG 2018"]
[]
[null,null,"Criterio",null,"Valoración","Tipo","Observaciones, Recomendaciones y/o Requerimientos"]
[null,null,"Criterio 9. Periodo de actualización de la información: anual, durante el primer trimestre del ejercicio en curso",{"$f":"IF(E45=\"Justificado\",0,1)","v":1}]
[null,null,"Criterio 10. La información publicada deberá estar actualizada al periodo que corresponde, de acuerdo con la Tabla de actualización y conservación de la información",1]
[null,null,"Criterio 11. Conservar en el sitio de Internet y a través de la Plataforma Nacional la información de acuerdo con la Tabla de actualización y conservación de la información",1]
[null,null,"Criterio 12. Área(s) responsable(s) que genera(n), posee(n), publica(n) y actualiza(n) la información",1]
[null,null,"Criterio 13. Fecha de actualización de la información publicada con el formato día/mes/año  ",1]
[null,null,"Criterio 14. Fecha de validación de la información publicada con el formato día/mes/año  ",1]
[null,null,"Criterio 15. Nota. Este criterio se cumple en caso de que sea necesario que el sujeto obligado incluya alguna aclaración relativa a la información publicada y/o explicación por la falta de información ",1]
[null,null,"Criterio 16. La información publicada se organiza mediante el formato 4, en el que se incluyen todos los campos especificados en los criterios sustantivos de contenido",1]
[null,null,"Criterio 17. El soporte de la información permite su reutilización",1]
{"$rows_empty":7}
[{"$nulls":3},2017,2018]
[null,null,"CS",{"$f":"IF(Aplicabilidad!G15<>\"SI\",\"NA\",SUM(E19:E25)/SUM(D19:D25))","v":"NA"},{"$f":"IF(Aplicabilidad!G15<>\"SI\",\"NA\",SUM(E33:E40)/SUM(D33:D40))","v":"NA"}]
[null,null,"CA",{"$f":"IF(Aplicabilidad!G15<>\"SI\",\"NA\",SUM(#REF!)/SUM(#REF!))","v":"NA"},{"$f":"IF(Aplicabilidad!G15<>\"SI\",\"NA\",SUM(E45:E53)/SUM(D45:D53))","v":"NA"}]
[null,null,"OBLIGACIÓN",{"$f":"IF(Aplicabilidad!G15<>\"SI\",\"NA\",D62*0.6+D63*0.4)","v":"NA"},{"$f":"IF(Aplicabilidad!G15<>\"SI\",\"NA\",E62*0.6+E63*0.4)","v":"NA"}]

{"sheet":"Art 74_V","index":7,"n_rows":79,"n_cols":7,"rows_kept":79,"hidden":true,"merged":[[0,2,0,6],[4,1,4,7],[14,4,14,6],[36,4,36,6]]}
[null,null,{"$f":"IF(Aplicabilidad!E2=\"\",\"\",Aplicabilidad!E2)","v":"Consejería Jurídica"}]
[]
[null,"Códigos de valoración : Cumplió totalmente = 1; Cumplió parcialmente = 0.5; No cumplió = 0; Justificado = Justificado"]
[]
[null,"Art. 74 - Fracción V. Indicadores interés público"]
[]
[null,null,"Fecha de Inicio de la Verificación:",{"$nulls":3},"Fecha de Término de la verificación"]
[null,null,{"$f":"IF(Resultados!$C$7=\"\",\"\",Resultados!$C$7)","v":"2021-07-07"},"2018-05-25",null,null,{"$f":"IF(Resultados!G7=\"\",\"\",Resultados!G7)","v":"2021-07-08"}]
[]
[null,null,"Criterios Sustantivos",null,{"$f":"IF(Aplicabilidad!G16<>\"SI\",\"NA\",(SUM(E19:E33)+SUM(E41:E55))/(SUM(D19:D33)+SUM(D41:D55)))","v":"NA"}]
[null,null,"Criterios Adjetivos",null,{"$f":"IF(Aplicabilidad!G16<>\"SI\",\"NA\",(SUM(E60:E68))/(SUM(D60:D68)))","v":"NA"}]
[null,null,"Obligación",null,{"$f":"IF(Aplicabilidad!G16<>\"SI\",\"NA\",E10*0.6+E11*0.4)","v":"NA"}]
[]
[]
[]
[null,null,"Criterios Sustantivos de contenido LTG 2015-2017",{"$f":"COUNTA(F19:F34)","v":0}]
[]
[null,null,"Criterio",null,"Valoración","Tipo","Observaciones, Recomendaciones y/o Requerimientos"]
[null,null,"Criterio 1. Ejercicio",{"$f":"IF(E19=\"Justificado\",0,1)","v":1}]
[null,null,"Criterio 2. Periodo que se informa",{"$f":"IF(E20=\"Justificado\",0,1)","v":1}]
[null,null,"Criterio 3. Descripción breve y clara de cada objetivo",1]
[null,null,"Criterio 4. Nombre del(os) indicador(es)",1]
[null,null,"Criterio 5. La(s) dimensión(es) a medir",1]
[null,null,"Criterio 6. Definición del indicador, es decir, explicación breve y clara respecto de lo que debe medir el indicador",1]
[null,null,"Criterio 7. Método de cálculo, es decir, las variables que intervienen en la fórmula. Se deberá especificar el significado de las siglas y/o abreviaturas",1]
[null,null,"Criterio 8. Unidad de medida",1]
[null,null,"Criterio 9. Frecuencia de medición",1]
[null,null,"Criterio 10. Línea base",1]
[null,null,"Criterio 11. Metas programadas",1]
[null,null,"Criterio 12. Metas ajustadas, en su caso",1]
[null,null,"Criterio 13. Avance de las metas al periodo que se informa",1]
[null,null,"Criterio 14. Sentido del indicador (Ascendente/Descendente)",{"$f":"IF(E32=\"Justificado\",0,1)","v":1}]
[null,null,"Criterio 15. Fuente de información (especificar la fuente de información que alimenta al indicador, por lo menos integrando: nombre de ésta e institución responsable de su medición)",{"$f":"IF(E33=\"Justificado\",0,1)","v":1}]
[]
[]
[]
[]
[null,null,"Criterios Sustantivos de contenido LTG 2018",{"$f":"COUNTA(F41:F68)","v":1}]
[]
[null,null,"Criterio",null,"Valoración","Tipo","Observaciones, Recomendaciones y/o Requerimientos"]
[null,null,"Criterio 1. Ejercicio",{"$f":"IF(E41=\"Justificado\",0,1)","v":1}]
[null,null,"Criterio 2. Periodo que se informa (fecha de inicio y fecha de término con el formato día/mes/año)",{"$f":"IF(E42=\"Justificado\",0,1)","v":1}]
[null,null,"Criterio 3. Descripción breve y clara de cada objetivo",1]
[null,null,"Criterio 4. Nombre del(os) indicador(es)",1]
[null,null,"Criterio 5. Dimensión(es) a medir",1]
[null,null,"Criterio 6. Definición del indicador, es decir, explicación breve y clara respecto de lo que debe medir el indicador",1]
[null,null,"Criterio 7. Método de cálculo, es decir, las variables que intervienen en la fórmula. Se deberá especificar el significado de las siglas y/o abreviaturas",1]
[null,null,"Criterio 8. Unidad de medida",1]
[null,null,"Criterio 9. Frecuencia de medición",1]
[null,null,"Criterio 10. Línea base (Punto de partida para evaluar y dar seguimiento al indicador)",1]
[null,null,"Criterio 11. Metas programadas",1]
[null,null,"Criterio 12. Metas ajustadas, en su caso",1]
[null,null,"Criterio 13. Avance de las metas al periodo que se informa",1]
[null,null,"Criterio 14. Sentido del indicador (catálogo): Ascendente/ Descendente",{"$f":"IF(E54=\"Justificado\",0,1)","v":1}]
[null,null,"Criterio 15. Fuente de información (especificar la fuente de información que alimenta al indicador, por lo menos integrando: nombre de ésta, e institución responsable de su medición)",{"$f":"IF(E55=\"Justificado\",0,1)","v":1}]
[]
[null,null,"Criterios Adjetivos LTG 2018"]
[]
[null,null,"Criterio",null,"Valoración","Tipo","Observaciones, Recomendaciones y/o Requerimientos"]
[null,null,"Criterio 16. Periodo de actualización de la información: trimestral",{"$f":"IF(E60=\"Justificado\",0,1)","v":1}]
[null,null,"Criterio 17. La información publicada deberá estar actualizada al periodo que corresponde de acuerdo con la Tabla de actualización y conservación de la información",1]
[null,null,"Criterio 18. Conservar en el sitio de Internet y a través de la Plataforma Nacional la información de acuerdo con la Tabla de actualización y conservación de la información",1]
[null,null,"Criterio 19. Área(s) responsable(s) que genera(n) posee(n), publica(n) y/o actualiza(n)la información ",1]
[null,null,"Criterio 20. Fecha de actualización de la información publicada con el formato día/mes/año  ",1]
[null,null,"Criterio 21. Fecha de validación de la información publicada con el formato día/mes/año  ",1]
[null,null,"Criterio 22. Nota. Este criterio se cumple en caso de que sea necesario que el sujeto obligado incluya alguna aclaración relativa a la información publicada y/o explicación por la falta de información",1]
[null,null,"Criterio 23. La información publicada se organiza mediante el formato 5, en el que se incluyen todos los campos especificados en los criterios sustantivos de contenido",1]
[null,null,"Criterio 24. El soporte de la información permite su reutilización",1]
{"$rows_empty":7}
[{"$nulls":3},2017,2018]
[null,null,"CS",{"$f":"IF(Aplicabilidad!G16<>\"SI\",\"NA\",SUM(E19:E33)/SUM(D19:D33))","v":"NA"},{"$f":"IF(Aplicabilidad!G16<>\"SI\",\"NA\",SUM(E41:E55)/SUM(D41:D55))","v":"NA"}]
[null,null,"CA",{"$f":"IF(Aplicabilidad!G16<>\"SI\",\"NA\",SUM(#REF!)/SUM(#REF!))","v":"NA"},{"$f":"IF(Aplicabilidad!G16<>\"SI\",\"NA\",SUM(E60:E68)/SUM(D60:D68))","v":"NA"}]
[null,null,"OBLIGACIÓN",{"$f":"IF(Aplicabilidad!G16<>\"SI\",\"NA\",D77*0.6+D78*0.4)","v":"NA"},{"$f":"IF(Aplicabilidad!G16<>\"SI\",\"NA\",E77*0.6+E78*0.4)","v":"NA"}]

{"sheet":"Art 74_VI","index":8,"n_rows":81,"n_cols":7,"rows_kept":81,"hidden":true,"merged":[[0,2,0,6],[4,1,4,7],[14,4,14,6],[37,4,37,6]]}
[null,null,{"$f":"IF(Aplicabilidad!E2=\"\",\"\",Aplicabilidad!E2)","v":"Consejería Jurídica"}]
[]
[null,"Códigos de valoración : Cumplió totalmente = 1; Cumplió parcialmente = 0.5; No cumplió = 0; Justificado = Justificado"]
[]
[null,"Art. 74 - Fracción VI. Indicadores de resultados"]
[]
[null,null,"Fecha de Inicio de la Verificación:",{"$nulls":3},"Fecha de Término de la verificación"]
[null,null,{"$f":"IF(Resultados!$C$7=\"\",\"\",Resultados!$C$7)","v":"2021-07-07"},"2018-05-25",null,null,{"$f":"IF(Resultados!G7=\"\",\"\",Resultados!G7)","v":"2021-07-08"}]
[]
[null,null,"Criterios Sustantivos",null,{"$f":"IF(Aplicabilidad!G17<>\"SI\",\"NA\",(SUM(E19:E34)+SUM(E42:E57))/(SUM(D19:D34)+SUM(D42:D57)))","v":"NA"}]
[null,null,"Criterios Adjetivos",null,{"$f":"IF(Aplicabilidad!G17<>\"SI\",\"NA\",(SUM(E62:E70))/(SUM(D62:D70)))","v":"NA"}]
[null,null,"Obligación",null,{"$f":"IF(Aplicabilidad!G17<>\"SI\",\"NA\",E10*0.6+E11*0.4)","v":"NA"}]
[]
[]
[]
[null,null,"Criterios Sustantivos de contenido LTG 2015-2017",{"$f":"COUNTA(F19:F35)","v":0}]
[]
[null,null,"Criterio",null,"Valoración","Tipo","Observaciones, Recomendaciones y/o Requerimientos"]
[null,null,"Criterio 1. Ejercicio",{"$f":"IF(E19=\"Justificado\",0,1)","v":1}]
[null,null,"Criterio 2. Periodo que se informa",{"$f":"IF(E20=\"Justificado\",0,1)","v":1}]
[null,null,"Criterio 3. Nombre del programa o concepto al que corresponde el indicador",1]
[null,null,"Criterio 4. Descripción breve y clara de cada objetivo institucional",1]
[null,null,"Criterio 5. Nombre del(os) indicador(es)",1]
[null,null,"Criterio 6. Dimensión(es) a medir (eficacia, eficiencia, calidad y economía)",1]
[null,null,"Criterio 7. Definición del indicador, es decir, explicación breve y clara respecto de lo que éste debe medir",1]
[null,null,"Criterio 8. Método de cálculo con las variables que intervienen en la fórmula, se deberá incluir el significado de las siglas y/o abreviaturas",1]
[null,null,"Criterio 9. Unidad de medida",1]
[null,null,"Criterio 10. Frecuencia de medición",1]
[null,null,"Criterio 11. Línea base",1]
[null,null,"Criterio 12. Metas programadas",1]
[null,null,"Criterio 13. Metas ajustadas que existan, en su caso",1]
[null,null,"Criterio 14. Avance de metas",1]
[null,null,"Criterio 15. Sentido del indicador (Ascendente/Descendente)",{"$f":"IF(E33=\"Justificado\",0,1)","v":1}]
[null,null,"Criterio 16. Fuentes de información (especificar la fuente de información que alimenta al indicador, por lo menos integrando: nombre de ésta e institución responsable de la fuente)",{"$f":"IF(E34=\"Justificado\",0,1)","v":1}]
[]
[]
[]
[]
[null,null,"Criterios Sustantivos de contenido LTG 2018",{"$f":"COUNTA(F42:F70)","v":1}]
[]
[null,null,"Criterio",null,"Valoración","Tipo","Observaciones, Recomendaciones y/o Requerimientos"]
[null,null,"Criterio 1. Ejercicio",{"$f":"IF(E42=\"Justificado\",0,1)","v":1}]
[null,null,"Criterio 2. Periodo que se informa (fecha de inicio y fecha de término con el formato día/mes/año)",{"$f":"IF(E43=\"Justificado\",0,1)","v":1}]
[null,null,"Criterio 3. Nombre del programa o concepto al que corresponde el indicador",1]
[null,null,"Criterio 4. Descripción breve y clara de cada objetivo institucional",1]
[null,null,"Criterio 5. Nombre del(os) indicador(es)",1]
[null,null,"Criterio 6. Dimensión(es) a medir. Por ejemplo: eficacia, eficiencia, calidad y economía",1]
[null,null,"Criterio 7. Definición del indicador, es decir, explicación breve y clara respecto de lo que éste debe medir",1]
[null,null,"Criterio 8. Método de cálculo con las variables que intervienen en la fórmula, se deberá incluir el significado de las siglas y/o abreviaturas",1]
[null,null,"Criterio 9. Unidad de medida",1]
[null,null,"Criterio 10. Frecuencia de medición",1]
[null,null,"Criterio 11. Línea base (Punto de partida para evaluar y dar seguimiento al indicador)",1]
[null,null,"Criterio 12. Metas programadas",1]
[null,null,"Criterio 13. Metas ajustadas que existan, en su caso",1]
[null,null,"Criterio 14. Avance de metas",1]
[null,null,"Criterio 15. Sentido del indicador (catálogo): Ascendente/Descendente",{"$f":"IF(E56=\"Justificado\",0,1)","v":1}]
[null,null,"Criterio 16. Fuentes de información (especificar la fuente de información que alimenta al indicador, por lo menos integrando: nombre de ésta e institución responsable de la fuente)",{"$f":"IF(E57=\"Justificado\",0,1)","v":1}]
[]
[null,null,"Criterios Adjetivos LTG 2018"]
[]
[null,null,"Criterio",null,"Valoración","Tipo","Observaciones, Recomendaciones y/o Requerimientos"]
[null,null,"Criterio 17. Periodo de actualización de la información: trimestral ",{"$f":"IF(E62=\"Justificado\",0,1)","v":1}]
[null,null,"Criterio 18. La información publicada deberá estar actualizada al periodo que corresponde de acuerdo con la Tabla de actualización y conservación de la información",1]
[null,null,"Criterio 19. Conservar en el sitio de Internet y a través de la Plataforma Nacional la información de acuerdo con la Tabla de actualización y conservación de la información",1]
[null,null,"Criterio 20. Área(s) responsable(s) que genera(n), posee(n), publica(n) y/o actualiza(n)la información  ",1]
[null,null,"Criterio 21. Fecha de actualización de la información publicada con el formato día/mes/año  ",1]
[null,null,"Criterio 22. Fecha de validación de la información publicada con el formato día/mes/año  ",1]
[null,null,"Criterio 23. Nota. Este criterio se cumple en caso de que sea necesario que el sujeto obligado incluya alguna aclaración relativa a la información publicada y/o explicación por la falta de información",1]
[null,null,"Criterio 24. La información publicada se organiza mediante el formato 6, en el que se incluyen todos los campos especificados en los criterios sustantivos de contenido",1]
[null,null,"Criterio 25. El soporte de la información permite su reutilización",1]
{"$rows_empty":7}
[{"$nulls":3},2017,2018]
[null,null,"CS",{"$f":"IF(Aplicabilidad!G17<>\"SI\",\"NA\",SUM(E19:E34)/SUM(D19:D34))","v":"NA"},{"$f":"IF(Aplicabilidad!G17<>\"SI\",\"NA\",SUM(E42:E57)/SUM(D42:D57))","v":"NA"}]
[null,null,"CA",{"$f":"IF(Aplicabilidad!G17<>\"SI\",\"NA\",SUM(#REF!)/SUM(#REF!))","v":"NA"},{"$f":"IF(Aplicabilidad!G17<>\"SI\",\"NA\",SUM(E62:E70)/SUM(D62:D70))","v":"NA"}]
[null,null,"OBLIGACIÓN",{"$f":"IF(Aplicabilidad!G17<>\"SI\",\"NA\",D79*0.6+D80*0.4)","v":"NA"},{"$f":"IF(Aplicabilidad!G17<>\"SI\",\"NA\",E79*0.6+E80*0.4)","v":"NA"}]

{"sheet":"Art 74_VII","index":9,"n_rows":52,"n_cols":7,"rows_kept":52,"merged":[[0,2,0,6],[4,1,4,7],[14,4,14,6]]}
[null,null,{"$f":"IF(Aplicabilidad!E2=\"\",\"\",Aplicabilidad!E2)","v":"Consejería Jurídica"}]
[]
[null,"Códigos de valoración : Cumplió totalmente = 1; Cumplió parcialmente = 0.5; No cumplió = 0; Justificado = Justificado"]
[]
[null,"Art. 74 - Fracción VII. Directorio"]
[]
[null,null,"Fecha de Inicio de la Verificación:",{"$nulls":3},"Fecha de Término de la verificación"]
[null,null,{"$f":"IF(Resultados!$C$7=\"\",\"\",Resultados!$C$7)","v":"2021-07-07"},"2018-05-25",null,null,{"$f":"IF(Resultados!G7=\"\",\"\",Resultados!G7)","v":"2021-07-08"}]
[]
[null,null,"Criterios Sustantivos",null,{"$f":"IF(Aplicabilidad!G18<>\"SI\",\"NA\",(+SUM(E19:E28))/(+SUM(D19:D28)))","v":{"v":1,"d":"100%"}}]
[null,null,"Criterios Adjetivos",null,{"$f":"IF(Aplicabilidad!G18<>\"SI\",\"NA\",(+SUM(E33:E41))/(+SUM(D33:D41)))","v":{"v":1,"d":"100%"}}]
[null,null,"Obligación",null,{"$f":"IF(Aplicabilidad!G18<>\"SI\",\"NA\",E10*0.6+E11*0.4)","v":{"v":1,"d":"100.00%"}}]
[]
[]
[]
[null,null,"Criterios Sustantivos de contenido LTG 2018",{"$f":"COUNTA(F19:F41)","v":1}]
[]
[null,null,"Criterio",null,"Valoración","Tipo","Observaciones, Recomendaciones y/o Requerimientos"]
[null,null,"Criterio 1. Ejercicio",{"$f":"IF(E19=\"Justificado\",0,1)","v":1},1]
[null,null,"Criterio 2. Periodo que se informa (fecha de inicio y fecha de término con el formato día/mes/año)",{"$f":"IF(E20=\"Justificado\",0,1)","v":1},1]
[null,null,"Criterio 3. Clave o nivel del puesto (de acuerdo con el catálogo que regule la actividad del sujeto obligado)",1,1]
[null,null,"Criterio 4. Denominación del cargo (de conformidad con nombramiento otorgado)",1,1]
[null,null,"Criterio 5. Nombre del servidor(a) público(a)(nombre[s], primer apellido, segundo apellido), integrante y/o miembro del sujeto obligado, y/o persona que desempeñe un empleo, cargo o comisión y/o ejerza actos de autoridad. En su caso, incluir una nota que especifique el motivo por el cual no existe servidor(a) público(a) ocupando el cargo, por ejemplo: Vacante",1,1]
[null,null,"Criterio 6. Área de adscripción (de acuerdo con el catálogo que, en su caso, regule la actividad del sujeto obligado)",1,1]
[null,null,"Criterio 7. Fecha de alta en el cargo con el formato día/mes/año ",1,1]
[null,null,"Criterio 8. Domicilio para recibir correspondencia oficial (tipo de vialidad [catálogo], nombre de vialidad [calle], número exterior, número interior [en su caso], tipo de asentamiento humano [catálogo], nombre de asentamiento humano [colonia], clave de la localidad, nombre de la localidad, clave del municipio, nombre del municipio o delegación, clave de la entidad federativa, nombre de la entidad federativa [catálogo], código postal)",1,1]
[null,null,"Criterio 9. Número(s) de teléfono(s) oficial(es) y extensión (es)",{"$f":"IF(E27=\"Justificado\",0,1)","v":1},1]
[null,null,"Criterio 10. Correo electrónico oficial, en su caso",{"$f":"IF(E28=\"Justificado\",0,1)","v":1},1]
[]
[null,null,"Criterios Adjetivos LTG 2018"]
[]
[null,null,"Criterio",null,"Valoración","Tipo","Observaciones, Recomendaciones y/o Requerimientos"]
[null,null,"Criterio 11. Periodo de actualización de la información: trimestral. En su caso, 15 días hábiles después de alguna modificación",{"$f":"IF(E33=\"Justificado\",0,1)","v":1},1]
[null,null,"Criterio 12. La información publicada deberá estar actualizada al periodo que corresponde de acuerdo con la Tabla de actualización y conservación de la información",1,1]
[null,null,"Criterio 13.Conservar en sitio de Internet: información vigente",1,1]
[null,null,"Criterio 14. Área(s) responsable(s)que genera(n), posee(n), publica(n) y actualiza(n) la información",1,1]
[null,null,"Criterio 15. Fecha de actualización de la información publicada con el formato día/mes/año ",1,1]
[null,null,"Criterio 16. Fecha de validación de la información publicada con el formato día/mes/año ",1,1]
[null,null,"Criterio 17. Nota. Este criterio se cumple en caso de que sea necesario que el sujeto obligado incluya alguna aclaración relativa a la información publicada y/o explicación por la falta de información ",1,1]
[null,null,"Criterio 18. La información publicada se organiza mediante el formato 7, en el que se incluyen todos los campos especificados en los criterios sustantivos de contenido",1,1]
[null,null,"Criterio 19. El soporte de la información permite su reutilización",1,1]
{"$rows_empty":7}
[{"$nulls":3},2017,2018]
[null,null,"CS","NA",{"$f":"IF(Aplicabilidad!G18<>\"SI\",\"NA\",SUM(E19:E28)/SUM(D19:D28))","v":{"v":1,"d":"100.00%"}}]
[null,null,"CA","NA",{"$f":"IF(Aplicabilidad!G18<>\"SI\",\"NA\",SUM(E33:E41)/SUM(D33:D41))","v":{"v":1,"d":"100.00%"}}]
[null,null,"OBLIGACIÓN","NA",{"$f":"IF(Aplicabilidad!G18<>\"SI\",\"NA\",E50*0.6+E51*0.4)","v":{"v":1,"d":"100.00%"}}]

{"sheet":"Art 74_VIII","index":10,"n_rows":141,"n_cols":7,"rows_kept":141,"merged":[[0,2,0,6],[4,1,4,7],[14,4,14,6],[41,4,41,6]]}
[null,null,{"$f":"IF(Aplicabilidad!E2=\"\",\"\",Aplicabilidad!E2)","v":"Consejería Jurídica"}]
[]
[null,"Códigos de valoración : Cumplió totalmente = 1; Cumplió parcialmente = 0.5; No cumplió = 0; Justificado = Justificado"]
[]
[null,"Art. 74 - Fracción VIII. Remuneración servidores públicos"]
[]
[null,null,"Fecha de Inicio de la Verificación:",{"$nulls":3},"Fecha de Término de la verificación"]
[null,null,{"$f":"IF(Resultados!$C$7=\"\",\"\",Resultados!$C$7)","v":"2021-07-07"},"2018-05-25",null,null,{"$f":"IF(Resultados!G7=\"\",\"\",Resultados!G7)","v":"2021-07-08"}]
[]
[null,null,"Criterios Sustantivos",null,{"$f":"IF(Aplicabilidad!G19<>\"SI\",\"NA\",(SUM(E19:E38)+SUM(E46:E120))/(SUM(D19:D38)+SUM(D46:D120)))","v":{"v":1,"d":"100%"}}]
[null,null,"Criterios Adjetivos",null,{"$f":"IF(Aplicabilidad!G19<>\"SI\",\"NA\",(SUM(E132:E141))/(SUM(D132:D141)))","v":{"v":1,"d":"100%"}}]
[null,null,"Obligación",null,{"$f":"IF(Aplicabilidad!G19<>\"SI\",\"NA\",E10*0.6+E11*0.4)","v":{"v":1,"d":"100.00%"}}]
[]
[]
[]
[null,null,"Criterios Sustantivos de contenido \nLTG 2018 - LTG 2020 (DOF 28/12/20) ",{"$f":"COUNTA(F19:F39)","v":0}]
[]
[null,null,"Criterio",null,"Valoración","Tipo","Observaciones, Recomendaciones y/o Requerimientos"]
[null,null,"Criterio 1. Tipo de integrante del sujeto obligado (funcionario, servidor[a] público[a] de base, de confianza, integrantes, miembros del sujeto obligado y/o toda persona que desempeñe un empleo, cargo o comisión y/o ejerza actos de autoridad, empleado, representante popular, miembro del poder judicial, miembro de órgano autónomo [especificar denominación], personal de confianza, prestador de servicios profesionales, otro [especificar denominación])",{"$f":"IF(E19=\"Justificado\",0,1)","v":0},"Justificado"]
[null,null,"Criterio 2. Clave o nivel del puesto (en su caso, de acuerdo con el catálogo que regule la actividad del sujeto obligado)",{"$f":"IF(E20=\"Justificado\",0,1)","v":0},"Justificado"]
[null,null,"Criterio 3. Denominación o descripción del puesto (de acuerdo con el catálogo que en su caso regule la actividad del sujeto obligado)",0,"Justificado"]
[null,null,"Criterio 4. Denominación del cargo (de conformidad con nombramiento otorgado)",0,"Justificado"]
[null,null,"Criterio 5. Área de adscripción (de acuerdo con el catálogo de unidades administrativas o puestos, si así corresponde)",0,"Justificado"]
[null,null,"Criterio 6. Nombre completo del(a) servidor(a) público(a) y/o toda persona que desempeñe un empleo, cargo o comisión y/o ejerzan actos de autoridad (nombre [s], primer apellido, segundo apellido)",0,"Justificado"]
[null,null,"Criterio 7. Sexo: Femenino/Masculino",0,"Justificado"]
[null,null,"Criterio 8. Remuneración mensual bruta (se refiere a las percepciones totales sin descuento alguno): Pesos mexicanos / Otra moneda (especificar nombre y nacionalidad de ésta)",0,"Justificado"]
[null,null,"Criterio 9. Remuneración mensual neta (se refiere a la remuneración mensual bruta menos las deducciones genéricas previstas por ley: ISR, ISSSTE, otra [especificar]) (Pesos mexicanos / Otra moneda [especificar nombre y nacionalidad de ésta])",0,"Justificado"]
[null,null,"Criterio 10. Percepciones en efectivo o en especie y adicionales, así como su periodicidad (Pesos mexicanos / Otra moneda [especificar nombre y nacionalidad de ésta])",0,"Justificado"]
[null,null,"Criterio 11. Ingresos y sistemas de compensación, así como su periodicidad (Pesos mexicanos / Otra moneda [especificar nombre y nacionalidad de ésta])",0,"Justificado"]
[null,null,"Criterio 12. Gratificaciones y su periodicidad (Pesos mexicanos / Otra moneda [especificar nombre y nacionalidad de ésta])",0,"Justificado"]
[null,null,"Criterio 13. Primas y su periodicidad (Pesos mexicanos / Otra moneda [especificar nombre y nacionalidad de ésta])",0,"Justificado"]
[null,null,"Criterio 14. Comisiones y su periodicidad (Pesos mexicanos / Otra moneda [especificar nombre y nacionalidad de ésta])",0,"Justificado"]
[null,null,"Criterio 15. Dietas y su periodicidad (Pesos mexicanos / Otra moneda [especificar nombre y nacionalidad de ésta])",0,"Justificado"]
[null,null,"Criterio 16. Bonos y su periodicidad (Pesos mexicanos / Otra moneda [especificar nombre y nacionalidad de ésta])",0,"Justificado"]
[null,null,"Criterio 17. Estímulos y su periodicidad (Pesos mexicanos / Otra moneda [especificar nombre y nacionalidad de ésta])",0,"Justificado"]
[null,null,"Criterio 18. Apoyos económicos y su periodicidad (Pesos mexicanos / Otra moneda [especificar nombre y nacionalidad de ésta])",0,"Justificado"]
[null,null,"Criterio 19. Prestaciones económicas y/o en especie que se otorguen por tipo de trabajador y de conformidad con la normatividad correspondiente (Pesos mexicanos / Otra moneda [especificar nombre y nacionalidad de ésta])",{"$f":"IF(E37=\"Justificado\",0,1)","v":0},"Justificado"]
[null,null,"Criterio 20. Otro tipo de percepción (Pesos mexicanos / Otra moneda [especificar nombre y nacionalidad de ésta])",{"$f":"IF(E38=\"Justificado\",0,1)","v":0},"Justificado"]
[]
[]
[]
[]
[null,null,"Criterios Sustantivos de contenido LTG 2018 - LTG 2020 (DOF 28/12/20) ",{"$f":"COUNTA(F46:F141)","v":1}]
[]
[null,null,"Criterio",null,"Valoración","Tipo","Observaciones, Recomendaciones y/o Requerimientos"]
[null,null,"Criterio 1. Ejercicio",{"$f":"IF(E46=\"Justificado\",0,1)","v":1},1]
[null,null,"Criterio 2. Periodo que se informa (fecha de inicio y fecha de término con el formato día/mes/año)",{"$f":"IF(E47=\"Justificado\",0,1)","v":1},1]
[null,null,"Criterio 3. Tipo de integrante del sujeto obligado (catálogo):  funcionario/servidor[a] público[a]/ servidor[a] público[a] eventual/integrante/empleado/representante popular/ miembro del poder judicial/miembro de órgano autónomo/personal de confianza/prestador de servicios profesionales/otro",1,1]
[null,null,"Criterio 4. Clave o nivel del puesto (en su caso, de acuerdo con el catálogo que regule la actividad del sujeto obligado)",1,1]
[null,null,"Criterio 5. Denominación o descripción del puesto (de acuerdo con el catálogo que en su caso regule la actividad del sujeto obligado)",1,1]
[null,null,"Criterio 6. Denominación del cargo (de conformidad con nombramiento otorgado)",1,1]
[null,null,"Criterio 7. Área de adscripción (de acuerdo con el catálogo de áreas o puestos, si así corresponde)",1,1]
[null,null,"Criterio 8. Nombre completo del(a) servidor(a) público(a) y/o toda persona que desempeñe un empleo, cargo o comisión y/o ejerzan actos de autoridad (nombre [s], primer apellido, segundo apellido)",1,1]
[null,null,"Criterio 9. Sexo (catálogo): Femenino/Masculino",1,1]
[null,null,"Criterio 10. Monto de la remuneración mensual bruta, de conformidad al Tabulador de sueldos y salarios que corresponda (se refiere a las percepciones totales sin descuento alguno)",1,1]
[null,null,"Criterio 11. Tipo de moneda de la remuneración bruta. Por ejemplo: Peso, Dólar, Euro, Libra, Yen ",1,1]
[null,null,"Criterio 12. Monto de la remuneración mensual neta, de conformidad al Tabulador de sueldos y salarios que corresponda (se refiere a la remuneración mensual bruta menos las deducciones genéricas previstas por ley: ISR, ISSSTE, otra) ",1,1]
[null,null,"Criterio 13. Tipo de moneda de la remuneración neta. Por ejemplo: Peso, Dólar, Euro, Libra, Yen ",1,1]
[null,null,"Criterio 14. Denominación de las percepciones adicionales en dinero",1,1]
[null,null,"Criterio 15. Monto bruto de las percepciones adicionales en dinero",1,1]
[null,null,"Criterio 16. Monto neto de las percepciones adicionales en dinero",1,1]
[null,null,"Criterio 17. Tipo de moneda de las percepciones adicionales en dinero. Por ejemplo: Peso, Dólar, Euro, Libra, Yen",1,1]
[null,null,"Criterio 18. Periodicidad de las percepciones adicionales en dinero",1,1]
[null,null,"Criterio 19. Descripción de las percepciones adicionales en especie  ",1,1]
[null,null,"Criterio 20. Periodicidad de las percepciones adicionales en especie ",1,1]
[null,null,"Criterio 21. Denominación de los ingresos ",1,1]
[null,null,"Criterio 22. Monto bruto de los ingresos",1,1]
[null,null,"Criterio 23. Monto neto de los ingresos",1,1]
[null,null,"Criterio 24. Tipo de moneda de los ingresos. Por ejemplo: Peso, Dólar, Euro, Libra, Yen",1,1]
[null,null,"Criterio 25. Periodicidad de los ingresos",1,1]
[null,null,"Criterio 26. Denominación de los sistemas de compensación",1,1]
[null,null,"Criterio 27. Monto bruto de los sistemas de compensación",1,1]
[null,null,"Criterio 28. Monto neto de los sistemas de compensación",1,1]
[null,null,"Criterio 29. Tipo de moneda de los sistemas de compensación. Por ejemplo: Peso, Dólar, Euro, Libra, Yen",1,1]
[null,null,"Criterio 30. Periodicidad de los sistemas de compensación",1,1]
[null,null,"Criterio 31. Denominación de las gratificaciones ",1,1]
[null,null,"Criterio 32. Monto bruto de las gratificaciones",1,1]
[null,null,"Criterio 33. Monto neto de las gratificaciones",1,1]
[null,null,"Criterio 34. Tipo de moneda de las gratificaciones. Por ejemplo: Peso, Dólar, Euro, Libra, Yen ",1,1]
[null,null,"Criterio 35. Periodicidad de las gratificaciones",1,1]
[null,null,"Criterio 36. Denominación de las primas ",1,1]
[null,null,"Criterio 37. Monto bruto de las primas",1,1]
[null,null,"Criterio 38. Monto neto de las primas",1,1]
[null,null,"Criterio 39. Tipo de moneda de las primas. Por ejemplo: Peso, Dólar, Euro, Libra, Yen ",1,1]
[null,null,"Criterio 40. Periodicidad de las primas",1,1]
[null,null,"Criterio 41. Denominación de las comisiones ",1,1]
[null,null,"Criterio 42. Monto bruto de las comisiones",1,1]
[null,null,"Criterio 43. Monto neto de las comisiones",1,1]
[null,null,"Criterio 44. Tipo de moneda de las comisiones. Por ejemplo: Peso, Dólar, Euro, Libra, Yen",1,1]
[null,null,"Criterio 45. Periodicidad de las comisiones",1,1]
[null,null,"Criterio 46. Denominación de las dietas",1,1]
[null,null,"Criterio 47. Monto bruto de las dietas",1,1]
[null,null,"Criterio 48. Monto neto de las dietas ",1,1]
[null,null,"Criterio 49. Tipo de moneda de las dietas. Por ejemplo: Peso, Dólar, Euro, Libra, Yen",1,1]
[null,null,"Criterio 50. Periodicidad de las dietas",1,1]
[null,null,"Criterio 51. Denominación de los bonos ",1,1]
[null,null,"Criterio 52. Monto bruto de los bonos",1,1]
[null,null,"Criterio 53. Monto neto de los bonos",1,1]
[null,null,"Criterio 54. Tipo de moneda de los bonos. Por ejemplo: Peso, Dólar, Euro, Libra, Yen",1,1]
[null,null,"Criterio 55. Periodicidad de los bonos",1,1]
[null,null,"Criterio 56. Denominación de los estímulos ",1,1]
[null,null,"Criterio 57. Monto bruto de los estímulos",1,1]
[null,null,"Criterio 58. Monto neto de los estímulos",1,1]
[null,null,"Criterio 59. Tipo de moneda de los estímulos. Por ejemplo: Peso, Dólar, Euro, Libra, Yen",1,1]
[null,null,"Criterio 60. Periodicidad de los estímulos",1,1]
[null,null,"Criterio 61. Denominación de los apoyos económicos. Por ejemplo, la asistencia legislativa que cubre a los CC. Diputados en apoyo para el desempeño de las funciones legislativas",1,1]
[null,null,"Criterio 62. Monto bruto de los apoyos económicos",1,1]
[null,null,"Criterio 63. Monto neto de los apoyos económicos",1,1]
[null,null,"Criterio 64. Tipo de moneda de los apoyos económicos. Por ejemplo: Peso, Dólar, Euro, Libra, Yen",1,1]
[null,null,"Criterio 65. Periodicidad de los apoyos económicos",1,1]
[null,null,"Criterio 66. Denominación de las prestaciones económicas. Por ejemplo, prestaciones de seguridad social, seguros y toda cantidad distinta del sueldo que el servidor público reciba en moneda circulante o en divisas, prevista en el nombramiento, en el contrato o en una disposición legal",{"$f":"IF(E111=\"Justificado\",0,1)","v":1},1]
[null,null,"Criterio 67. Monto bruto de las prestaciones económicas",1,1]
[null,null,"Criterio 68. Monto neto de las prestaciones económicas",1,1]
[null,null,"Criterio 69. Tipo de moneda de las prestaciones económicas. Por ejemplo: Peso, Dólar, Euro, Libra, Yen (especificar nombre)",1,1]
[null,null,"Criterio 70. Periodicidad de las prestaciones económicas",1,1]
[null,null,"Criterio 71. Descripción de las prestaciones en especie. Éstas podrán ser por ejemplo, todo beneficio que el servidor(a) público(a)reciba en bienes distintos de la moneda circulante.",{"$f":"IF(E116=\"Justificado\",0,1)","v":1},1]
[null,null,"Criterio 72. Periodicidad de las prestaciones en especie",{"$f":"IF(E117=\"Justificado\",0,1)","v":1},1]
[null,null,"Criterio 75. Ejercicio (Formato adicionado DOF 28/12/2020)",{"$f":"IF(E118=\"Justificado\",0,1)","v":1},1]
[null,null,"Criterio 74. Periodo que se informa (fecha de inicio y fecha de término con el formato día/mes/año) (Formato adicionado DOF 28/12/2020)",1,1]
[null,null,"Criterio 73. Hipervínculo al/los tabulador/es de sueldos y salarios del sujeto obligado de conformidad con la normatividad aplicable. El tabulador deberá estar en un formato de datos abiertos (Formato adicionado DOF 28/12/2020)",{"$f":"IF(E120=\"Justificado\",0,1)","v":1},1]
{"$rows_empty":8}
[null,null,"Criterios Adjetivos LTG 2018 - LTG 2020 (DOF 28/12/20) "]
[]
[null,null,"Criterio",null,"Valoración","Tipo","Observaciones, Recomendaciones y/o Requerimientos"]
[null,null,"Criterio 73 (LTG 2018 ). Periodo de actualización de la información: semestral. En caso de que exista alguna modificación antes de la conclusión del periodo, la información deberá actualizarse a más tardar en los 15 días hábiles posteriores.",{"$f":"IF(E132=\"Justificado\",0,1)","v":1},1]
[null,null,"Criterio 73. (LTG 2020 (DOF 28/12/2020)  Periodo de actualización de la información: Trimestral. En caso de que exista alguna modificación antes de la conclusión del periodo, la información deberá actualizarse a más tardar en los 15 días hábiles posteriores.",1,1]
[null,null,"Criterio 74. La información publicada deberá estar actualizada al periodo que corresponde de acuerdo con la Tabla de actualización y conservación de la información",1,1]
[null,null,"Criterio 75. Conservar en el sitio de Internet y a través de la Plataforma Nacional la información Información del ejercicio en curso y la\ncorrespondiente al ejercicio inmediato anterior",1,1]
[null,null,"Criterio 76. Área(s) responsable(s) que genera(n), posee(n), publica(n) y/o actualiza(n)la información ",1,1]
[null,null,"Criterio 77. Fecha de actualización de la información publicada con el formato día/mes/año ",1,1]
[null,null,"Criterio 78. Fecha de validación de la información publicada con el formato día/mes/año  ",1,1]
[null,null,"Criterio 79. Nota. Este criterio se cumple en caso de que sea necesario que el sujeto obligado incluya alguna aclaración relativa a la información publicada y/o explicación por la falta de información",1,1]
[null,null,"Criterio 80 . La información publicada se organiza mediante el formato 8, en el que se incluyen todos los campos especificados en los criterios sustantivos de contenido",1,1]
[null,null,"Criterio 81. El soporte de la información permite su reutilización",1,1]

{"sheet":"Art 74_IX","index":11,"n_rows":128,"n_cols":7,"rows_kept":128,"merged":[[0,2,0,6],[4,1,4,7],[14,4,14,6],[73,4,73,6]]}
[null,null,{"$f":"IF(Aplicabilidad!E2=\"\",\"\",Aplicabilidad!E2)","v":"Consejería Jurídica"}]
[]
[null,"Códigos de valoración : Cumplió totalmente = 1; Cumplió parcialmente = 0.5; No cumplió = 0; Justificado = Justificado"]
[]
[null,"Art. 74 - Fracción IX. Gastos de representación y viáticos"]
[]
[null,null,"Fecha de Inicio de la Verificación:",{"$nulls":3},"Fecha de Término de la verificación"]
[null,null,{"$f":"IF(Resultados!$C$7=\"\",\"\",Resultados!$C$7)","v":"2021-07-07"},"2018-05-25",null,null,{"$f":"IF(Resultados!G7=\"\",\"\",Resultados!G7)","v":"2021-07-08"}]
[]
[null,null,"Criterios Sustantivos",null,{"$f":"IF(Aplicabilidad!G20<>\"SI\",\"NA\",(SUM(E19:E70)+SUM(E78:E104))/(SUM(D19:D70)+SUM(D78:D104)))","v":{"v":0.9444444444444444,"d":"94%"}}]
[null,null,"Criterios Adjetivos",null,{"$f":"IF(Aplicabilidad!G20<>\"SI\",\"NA\",(SUM(E109:E117))/(SUM(D109:D117)))","v":{"v":1,"d":"100%"}}]
[null,null,"Obligación",null,{"$f":"IF(Aplicabilidad!G20<>\"SI\",\"NA\",E10*0.6+E11*0.4)","v":{"v":0.9666666666666667,"d":"96.67%"}}]
[]
[]
[]
[null,null,"Criterios Sustantivos de contenido \nLTG 2018 - LTG 2020 (DOF 28/12/20) ",{"$f":"COUNTA(F19:F71)","v":0}]
[]
[null,null,"Criterio",null,"Valoración","Tipo","Observaciones, Recomendaciones y/o Requerimientos"]
[null,null,"Criterio 1. Ejercicio",{"$f":"IF(E19=\"Justificado\",0,1)","v":0},"Justificado"]
[null,null,"Criterio 2. Periodo que se informa",{"$f":"IF(E20=\"Justificado\",0,1)","v":0},"Justificado"]
[null,null,"Criterio 3. Tipo de integrante del sujeto obligado (funcionario, servidor[a] público[a], integrantes, miembros y/o toda persona que desempeñe un empleo, cargo o comisión en los sujetos obligados y/o ejerza actos de autoridad en ellos, empleado, representante popular, miembro del poder judicial, miembro de órgano autónomo [especificar denominación], personal de confianza, prestador de servicios profesionales, otro [especificar denominación])",0,"Justificado"]
[null,null,"Criterio 4. Clave o nivel del puesto (de acuerdo con el catálogo que en su caso regule la actividad del sujeto obligado)",0,"Justificado"]
[null,null,"Criterio 5. Denominación del puesto (de acuerdo con el catálogo que en su caso regule la actividad del sujeto obligado, por ej. Subdirector[a] A)",0,"Justificado"]
[null,null,"Criterio 6. Denominación del cargo (de conformidad con el nombramiento otorgado, por ej. Subdirector[a] de recursos humanos)",0,"Justificado"]
[null,null,"Criterio 7. Área de adscripción o unidad administrativa (de acuerdo con el catálogo de unidades administrativas o puestos si así corresponde)",0,"Justificado"]
[null,null,"Criterio 8. Nombre completo del (la) servidor(a) público(a), trabajador, prestador de servicios, miembro y/o toda persona que desempeñe un empleo, cargo o comisión y/o ejerza actos de autoridad en el sujeto obligado (nombre[s], primer apellido, segundo apellido)",0,"Justificado"]
[null,null,"Criterio 9. Denominación del encargo o comisión",0,"Justificado"]
[null,null,"Criterio 10. Tipo de viaje (nacional / internacional)",0,"Justificado"]
[null,null,"Criterio 11. Número de personas acompañantes en el encargo o comisión del trabajador, prestador de servicios, servidor(a) público(a), miembro y/o toda persona que desempeñe un empleo, cargo o comisión y/o ejerza actos de autoridad en el sujeto obligado comisionado",0,"Justificado"]
[null,null,"Criterio 12. Importe ejercido por el total de acompañantes",0,"Justificado"]
[null,null,"Criterio 13. Origen del encargo o comisión (país, estado y ciudad)",0,"Justificado"]
[null,null,"Criterio 14. Destino del encargo o comisión (país, estado y ciudad)",0,"Justificado"]
[null,null,"Criterio 15. Motivo del encargo o comisión",0,"Justificado"]
[null,null,"Criterio 16. Fecha de salida: con el formato día/mes/año (por ej. 31/Marzo/2016)",0,"Justificado"]
[null,null,"Criterio 17. Fecha de regreso: con el formato día/mes/año (por ej. 30/Abril/2016)",0,"Justificado"]
[null,null,"Criterio 18. Clave de la partida de cada uno de los conceptos correspondientes, con base en el Clasificador por Objeto del Gasto o Clasificador Contable que aplique",0,"Justificado"]
[null,null,"Criterio 19. Denominación de la partida de cada uno de los conceptos correspondientes, los cuales deberán ser armónicos con el Clasificador por Objeto del Gasto o Clasificador Contable que aplique. Por ejemplo: pasajes aéreos, terrestres, marítimos, lacustres y fluviales; autotransporte; viáticos en el país o en el extranjero; gastos de instalación y traslado de menaje; servicios integrales de traslado y viáticos; otros servicios de traslado y hospedaje; otra (especificar)",0,"Justificado"]
[null,null,"Criterio 20. Importe ejercido erogado por concepto de viáticos",0,"Justificado"]
[null,null,"Criterio 21. Importe total ejercido erogado con motivo del encargo o comisión",0,"Justificado"]
[null,null,"Criterio 22. Importe total de gastos no erogados derivados del encargo o comisión",0,"Justificado"]
[null,null,"Criterio 23. Fecha de entrega del informe de la comisión o encargo encomendado, con el formato día/mes/año (por ej. 31/Marzo/2016)",0,"Justificado"]
[null,null,"Criterio 24. Hipervínculo al informe de la comisión o encargo encomendado, donde se señalen las actividades realizadas, los resultados obtenidos, las contribuciones a la institución y las conclusiones; en su caso, se deberá incluir una leyenda explicando lo que corresponda",0,"Justificado"]
[null,null,"Criterio 25. Hipervínculo a las facturas o comprobantes que soporten las erogaciones realizadas",0,"Justificado"]
[null,null,"Criterio 26. Hipervínculo a la normatividad que regula los gastos por concepto de viáticos del sujeto obligado",0,"Justificado"]
[null,null,"Criterio 27. Ejercicio",0,"Justificado"]
[null,null,"Criterio 28. Periodo que se reporta",0,"Justificado"]
[null,null,"Criterio 29. Tipo de miembro del sujeto obligado (funcionario, servidor[a] público[a] y/o toda persona que desempeñe un empleo, cargo o comisión y/o ejerza actos de autoridad en el sujeto obligado; empleado, representante popular, miembro del poder judicial, miembro de órgano autónomo [especificar denominación], personal de confianza, integrante, prestador de servicios profesionales, otro [señalar denominación])",0,"Justificado"]
[null,null,"Criterio 30. Clave o nivel del puesto (de acuerdo con el catálogo que en su caso regule la actividad del sujeto obligado)",0,"Justificado"]
[null,null,"Criterio 31. Denominación del puesto (de acuerdo con el catálogo que en su caso regule la actividad del sujeto obligado, por ej. Subdirector[a] A)",0,"Justificado"]
[null,null,"Criterio 32. Denominación del cargo (de conformidad con el nombramiento otorgado, por ej. Subdirector[a] de recursos humanos)",0,"Justificado"]
[null,null,"Criterio 33. Área de adscripción (de acuerdo con el catálogo de unidades administrativas o puestos, si así corresponde)",0,"Justificado"]
[null,null,"Criterio 34. Nombre completo del (la) servidor(a) público(a), trabajador, prestador de servicios, miembro y/o toda persona que desempeñe un empleo, cargo o comisión y/o ejerzan actos de autoridad en el sujeto obligado (nombre[s], primer apellido y segundo apellido)",0,"Justificado"]
[null,null,"Criterio 35. Denominación del acto de representación",0,"Justificado"]
[null,null,"Criterio 36. Tipo de viaje (nacional/internacional)",0,"Justificado"]
[null,null,"Criterio 37. Número de personas acompañantes en el acto de representación del trabajador, prestador de servicios, servidor(a) público(a), miembro y/o toda persona que desempeñe un empleo, cargo o comisión y/o ejerzan actos de autoridad comisionado",0,"Justificado"]
[null,null,"Criterio 38. Importe ejercido por el total de acompañantes",0,"Justificado"]
[null,null,"Criterio 39. Origen del acto de representación (país, estado y ciudad)",0,"Justificado"]
[null,null,"Criterio 40. Destino del acto de representación (país, estado y ciudad)",0,"Justificado"]
[null,null,"Criterio 41. Motivo del acto de representación",0,"Justificado"]
[null,null,"Criterio 42. Fecha de salida: con el formato día/mes/año (por ej. 31/Marzo/2016)",0,"Justificado"]
[null,null,"Criterio 43. Fecha de regreso: con el formato día/mes/año (por ej. 30/Abril/2016)",0,"Justificado"]
[null,null,"Criterio 44. Clave de la partida de cada uno de los conceptos correspondientes, con base en el Clasificador por Objeto del Gasto o Clasificador Contable que aplique",0,"Justificado"]
[null,null,"Criterio 45. Denominación de la partida de cada uno de los conceptos correspondientes, los cuales deberán ser armónicos con el Clasificador por Objeto del Gasto o Clasificador Contable que aplique. Por ejemplo: pasajes aéreos, terrestres, marítimos, lacustres y fluviales; autotransporte; viáticos en el país o en el extranjero; gastos de instalación y traslado de menaje; servicios integrales de traslado y viáticos; otros servicios de traslado y hospedaje; otro (especificar)",0,"Justificado"]
[null,null,"Criterio 46. Importe ejercido erogado por concepto de gastos de representación",0,"Justificado"]
[null,null,"Criterio 47. Importe total ejercido erogado con motivo del acto de representación",0,"Justificado"]
[null,null,"Criterio 48. Importe total de gastos no erogados derivados del acto de representación",0,"Justificado"]
[null,null,"Criterio 49. Fecha de entrega del informe del acto de representación encomendado, con el formato día/mes/año (por ej. 31/Marzo/2016)",0,"Justificado"]
[null,null,"Criterio 50. Hipervínculo al informe del acto de representación encomendado, donde se señalen las actividades realizadas, los resultados obtenidos, las contribuciones a la institución y las conclusiones; en su caso, se deberá incluir una leyenda explicando lo que corresponda",0,"Justificado"]
[null,null,"Criterio 51. Hipervínculo a las facturas o comprobantes que soporten las erogaciones realizadas",{"$f":"IF(E69=\"Justificado\",0,1)","v":0},"Justificado"]
[null,null,"Criterio 52. Hipervínculo a la normatividad que regula los gastos de representación del sujeto obligado",{"$f":"IF(E70=\"Justificado\",0,1)","v":0},"Justificado"]
[]
[]
[]
[]
[null,null,"Criterios Sustantivos de contenido LTG 2018 - LTG 2020 (DOF 28/12/20) ",{"$f":"COUNTA(F78:F117)","v":4}]
[]
[null,null,"Criterio",null,"Valoración","Tipo","Observaciones, Recomendaciones y/o Requerimientos"]
[null,null,"Criterio 1. Ejercicio",{"$f":"IF(E78=\"Justificado\",0,1)","v":1},1]
[null,null,"Criterio 2. Periodo que se informa (fecha de inicio y fecha de término con el formato día/mes/año)",{"$f":"IF(E79=\"Justificado\",0,1)","v":1},1]
[null,null,"Criterio 3. Tipo de integrante del sujeto obligado (catálogo): (funcionario, servidor[a] público[a], eventual/integrante/empleado/representante popular/ miembro del poder judicial/miembro de órgano autónomo/personal de confianza/prestador de servicios profesionales/ servidor público eventual/ otro [especificar denominación])",1,1]
[null,null,"Criterio 4. Clave o nivel del puesto (de acuerdo con el catálogo que en su caso regule la actividad del sujeto obligado)",1,1]
[null,null,"Criterio 5. Denominación del puesto (de acuerdo con el catálogo que en su caso regule la actividad del sujeto obligado, por ejemplo: Subdirector[a] A)",1,1]
[null,null,"Criterio 6. Denominación del cargo (de conformidad con el nombramiento otorgado, por ejemplo: Subdirector[a] de recursos humanos)",1,1]
[null,null,"Criterio 7. Área de adscripción (de acuerdo con el catálogo de áreas o puestos si así corresponde)",1,1]
[null,null,"Criterio 8. Nombre completo del (la) servidor(a) público(a), trabajador, prestador de servicios, miembro y/o toda persona que desempeñe un empleo, cargo o comisión y/o ejerza actos de autoridad en el sujeto obligado (nombre[s], primer apellido, segundo apellido)",1,1]
[null,null,"Criterio 9. Tipo de gasto (catálogo): Viáticos/Representación ",1,1]
[null,null,"Criterio 10. Denominación del encargo o comisión",1,1]
[null,null,"Criterio 11. Tipo de viaje (catálogo): Nacional / Internacional",1,1]
[null,null,"Criterio 12. Número de personas acompañantes en el encargo o comisión del trabajador, prestador de servicios, servidor(a) público(a), miembro y/o toda persona que desempeñe un empleo, cargo o comisión y/o ejerza actos de autoridad en el sujeto obligado comisionado",1,1]
[null,null,"Criterio 13. Importe ejercido por el total de acompañantes",1,1]
[null,null,"Criterio 14. Origen del encargo o comisión (país, estado y ciudad)",1,1]
[null,null,"Criterio 15. Destino del encargo o comisión (país, estado y ciudad)",1,1]
[null,null,"Criterio 16. Motivo del encargo o comisión",1,1]
[null,null,"Criterio 17. Fecha de salida del encargo o comisión con el formato día/mes/año ",1,1]
[null,null,"Criterio 18. Fecha de regreso del encargo o comisión: con el formato día/mes/año ",1,1]
[null,null,"Criterio 19. Clave de la partida de cada uno de los conceptos correspondientes, con base en el Clasificador por Objeto del Gasto o Clasificador Contable que aplique",1,1]
[null,null,"Criterio 20. Denominación de la partida de cada uno de los conceptos correspondientes, los cuales deberán ser armónicos con el Clasificador por Objeto del Gasto o Clasificador Contable que aplique. Por ejemplo: pasajes aéreos, terrestres, marítimos, lacustres y fluviales; autotransporte; viáticos en el país o en el extranjero; gastos de instalación y traslado de menaje; servicios integrales de traslado y viáticos; otros servicios de traslado y hospedaje; otra (especificar)",1,1]
[null,null,"Criterio 21. Importe ejercido erogado por concepto de gastos de viáticos o gastos de representación",1,0.5,"Requerimiento","Existen registros donde no hay información publicada ni nota informativa que justifique la falta de información."]
[null,null,"Criterio 22. Importe total ejercido erogado con motivo del encargo o comisión",1,0.5,"Requerimiento","Existen registros donde no hay información publicada ni nota informativa que justifique la falta de información."]
[null,null,"Criterio 23. Importe total de gastos no erogados derivados del encargo o comisión",1,0.5,"Requerimiento","Existen registros donde no hay información publicada ni nota informativa que justifique la falta de información."]
[null,null,"Criterio 24. Fecha de entrega del informe de la comisión o encargo encomendado, con el formato día/mes/año ",1,1]
[null,null,"Criterio 25. Hipervínculo al informe de la comisión o encargo encomendado, donde se señalen las actividades realizadas, los resultados obtenidos, las contribuciones a la institución y las conclusiones; en su caso, se deberá incluir una nota explicando lo que corresponda",1,1]
[null,null,"Criterio 26. Hipervínculo a las facturas o comprobantes que soporten las erogaciones realizadas",{"$f":"IF(E103=\"Justificado\",0,1)","v":1},1]
[null,null,"Criterio 27. Hipervínculo a la normatividad que regula los gastos por concepto de viáticos y gastos de representación del sujeto obligado",{"$f":"IF(E104=\"Justificado\",0,1)","v":1},1]
[]
[null,null,"Criterios Adjetivos LTG 2018 - LTG 2020 (DOF 28/12/20) "]
[]
[null,null,"Criterio",null,"Valoración","Tipo","Observaciones, Recomendaciones y/o Requerimientos"]
[null,null,"Criterio 28. Periodo de actualización de la información: trimestral",{"$f":"IF(E109=\"Justificado\",0,1)","v":1},1]
[null,null,"Criterio 29. La información publicada deberá estar actualizada al periodo que corresponde de acuerdo con la Tabla de actualización y conservación de la información",1,1]
[null,null,"Criterio 30. Conservar en el sitio de Internet: información del ejercicio en curso y la correspondiente al ejercicio anterior.",1,1]
[null,null,"Criterio 31. Área(s) responsable(s) que genera(n), posee(n), publica(n) y/o actualiza(n)la información ",1,1]
[null,null,"Criterio 32. Fecha de actualización de la información publicada con el formato día/mes/año ",1,1]
[null,null,"Criterio 33. Fecha de validación de la información publicada con el formato día/mes/año ",1,1]
[null,null,"Criterio 34. Nota. Este criterio se cumple en caso de que sea necesario que el sujeto obligado incluya alguna aclaración relativa a la información publicada y/o explicación por la falta de información",1,1]
[null,null,"Criterio 35. La información publicada se organiza mediante el formato 9a, en el cual se incluye todos los campos especificados en los criterios sustantivos de contenido",1,1]
[null,null,"Criterio 36. El soporte de la información permite su reutilización",1,1]
{"$rows_empty":7}
[{"$nulls":3},2017,2018]
[null,null,"CS",{"$f":"IF(Aplicabilidad!G20<>\"SI\",\"NA\",SUM(E19:E70)/SUM(D19:D70))","v":{"$error":"#DIV/0!"}},{"$f":"IF(Aplicabilidad!G20<>\"SI\",\"NA\",SUM(E78:E104)/SUM(D78:D104))","v":{"v":0.9444444444444444,"d":"94.44%"}}]
[null,null,"CA",{"$f":"IF(Aplicabilidad!G20<>\"SI\",\"NA\",SUM(#REF!)/SUM(#REF!))","v":{"$error":"#REF!"}},{"$f":"IF(Aplicabilidad!G20<>\"SI\",\"NA\",SUM(E109:E117)/SUM(D109:D117))","v":{"v":1,"d":"100.00%"}}]
[null,null,"OBLIGACIÓN",{"$f":"IF(Aplicabilidad!G20<>\"SI\",\"NA\",D126*0.6+D127*0.4)","v":{"$error":"#DIV/0!"}},{"$f":"IF(Aplicabilidad!G20<>\"SI\",\"NA\",E126*0.6+E127*0.4)","v":{"v":0.9666666666666667,"d":"96.67%"}}]

{"sheet":"Art 74_X","index":12,"n_rows":59,"n_cols":7,"rows_kept":59,"merged":[[0,2,0,6],[4,1,4,7],[14,4,14,6]]}
[null,null,{"$f":"IF(Aplicabilidad!E2=\"\",\"\",Aplicabilidad!E2)","v":"Consejería Jurídica"}]
[]
[null,"Códigos de valoración : Cumplió totalmente = 1; Cumplió parcialmente = 0.5; No cumplió = 0; Justificado = Justificado"]
[]
[null,"Art. 74 - Fracción X. Total de plazas (base y confianza)"]
[]
[null,null,"Fecha de Inicio de la Verificación:",{"$nulls":3},"Fecha de Término de la verificación"]
[null,null,{"$f":"IF(Resultados!$C$7=\"\",\"\",Resultados!$C$7)","v":"2021-07-07"},"2018-05-25",null,null,{"$f":"IF(Resultados!G7=\"\",\"\",Resultados!G7)","v":"2021-07-08"}]
[]
[null,null,"Criterios Sustantivos",null,{"$f":"IF(Aplicabilidad!G21<>\"SI\",\"NA\",(+SUM(E19:E35))/(+SUM(D19:D35)))","v":{"v":1,"d":"100%"}}]
[null,null,"Criterios Adjetivos",null,{"$f":"IF(Aplicabilidad!G21<>\"SI\",\"NA\",(+SUM(E40:E48))/(+SUM(D40:D48)))","v":{"v":1,"d":"100%"}}]
[null,null,"Obligación",null,{"$f":"IF(Aplicabilidad!G21<>\"SI\",\"NA\",E10*0.6+E11*0.4)","v":{"v":1,"d":"100.00%"}}]
[]
[]
[]
[null,null,"Criterios Sustantivos de contenido \nLTG 2018 - LTG 2020 (DOF 28/12/20) ",{"$f":"COUNTA(F19:F48)","v":1}]
[]
[null,null,"Criterio",null,"Valoración","Tipo","Observaciones, Recomendaciones y/o Requerimientos"]
[null,null,"Criterio 1. Ejercicio ",{"$f":"IF(E19=\"Justificado\",0,1)","v":1},1]
[null,null,"Criterio 2. Periodo que se informa (fecha de inicio y fecha de término con el formato día/mes/año)",{"$f":"IF(E20=\"Justificado\",0,1)","v":1},1]
[null,null,"Criterio 3. Denominación del área (de acuerdo con el catálogo que en su caso regule la actividad del sujeto obligado)",1,1]
[null,null,"Criterio 4. Denominación del puesto (de acuerdo con el catálogo que en su caso regule la actividad del sujeto obligado). La información deberá estar ordenada de tal forma que sea posible visualizar los niveles de autoridad y sus relaciones de dependencia",1,1]
[null,null,"Criterio 5. Clave o nivel del puesto (de acuerdo con el catálogo que en su caso regule la actividad del sujeto obligado)",1,1]
[null,null,"Criterio 6. Tipo de plaza (catálogo): base/confianza/milicia permanente/milicia auxiliar",1,1]
[null,null,"Criterio 7. Área de adscripción inmediata superior",1,1]
[null,null,"Criterio 8. Por cada puesto y/o cargo de la estructura especificar el estado (catálogo): ocupado/vacante.",1,1]
[null,null,"Criterio 9. Por cada puesto y/o cargo de la estructura vacante se incluirá un hipervínculo a las convocatorias a concursos para ocupar cargos públicos abiertos a la sociedad en general o sólo abiertos a los(as) servidores(as) públicos(as) del sujeto obligado, difundidas en la fracción XIV del artículo 70 de la Ley General",0,"Justificado"]
[null,null,"Criterio 10. Ejercicio ",1,1]
[null,null,"Criterio 11. Periodo que se informa (fecha de inicio y fecha de término con el formato día/mes/año)",1,1]
[null,null,"Criterio 12. Total de plazas de base",1,1]
[null,null,"Criterio 13. Total de plazas de base ocupadas",1,1]
[null,null,"Criterio 14. Total de plazas de base vacantes",1,1]
[null,null,"Criterio 15. Total de plazas de confianza",1,1]
[null,null,"Criterio 16. Total de plazas de confianza ocupadas",{"$f":"IF(E34=\"Justificado\",0,1)","v":1},1]
[null,null,"Criterio 17. Total de plazas de confianza vacantes",{"$f":"IF(E35=\"Justificado\",0,1)","v":1},1]
[]
[null,null,"Criterios Adjetivos LTG 2018 - LTG 2020 (DOF 28/12/20) "]
[]
[null,null,"Criterio",null,"Valoración","Tipo","Observaciones, Recomendaciones y/o Requerimientos"]
[null,null,"Criterio 18. Periodo de actualización de la información: trimestral",{"$f":"IF(E40=\"Justificado\",0,1)","v":1},1]
[null,null,"Criterio 19. La información publicada deberá estar actualizada al periodo que corresponde de acuerdo con la Tabla de actualización y conservación de la información",1,1]
[null,null,"Criterio 20. Conservar en el sitio de Internet y a través de la Plataforma Nacional la información vigente",1,1]
[null,null,"Criterio 21. Área(s) responsable(s) que genera(n), posee(n), publica(n) y/o actualiza(n)la información ",1,1]
[null,null,"Criterio 22. Fecha de actualización de la información publicada con el formato día/mes/año ",1,1]
[null,null,"Criterio 23. Fecha de validación de la información publicada con el formato día/mes/año ",1,1]
[null,null,"Criterio 24. Nota. Este criterio se cumple en caso de que sea necesario que el sujeto obligado incluya alguna aclaración relativa a la información publicada y/o explicación por la falta de información ",1,1]
[null,null,"Criterio 25. La información publicada se organiza mediante los formatos 10a y 10b, en los cuales se incluyen todos los campos especificados en los criterios sustantivos de contenido",1,1]
[null,null,"Criterio 26. El soporte de la información permite su reutilización",1,1]
{"$rows_empty":7}
[{"$nulls":3},2017,2018]
[null,null,"CS","NA",{"$f":"IF(Aplicabilidad!G21<>\"SI\",\"NA\",SUM(E19:E35)/SUM(D19:D35))","v":{"v":1,"d":"100.00%"}}]
[null,null,"CA","NA",{"$f":"IF(Aplicabilidad!G21<>\"SI\",\"NA\",SUM(E40:E48)/SUM(D40:D48))","v":{"v":1,"d":"100.00%"}}]
[null,null,"OBLIGACIÓN","NA",{"$f":"IF(Aplicabilidad!G21<>\"SI\",\"NA\",E57*0.6+E58*0.4)","v":{"v":1,"d":"100.00%"}}]

{"sheet":"Art 74_XI","index":13,"n_rows":77,"n_cols":7,"rows_kept":77,"merged":[[0,2,0,6],[4,1,4,7],[14,4,14,6],[35,4,35,6]]}
[null,null,{"$f":"IF(Aplicabilidad!E2=\"\",\"\",Aplicabilidad!E2)","v":"Consejería Jurídica"}]
[]
[null,"Códigos de valoración : Cumplió totalmente = 1; Cumplió parcialmente = 0.5; No cumplió = 0; Justificado = Justificado"]
[]
[null,"Art. 74 - Fracción XI. Contrataciones honorarios"]
[]
[null,null,"Fecha de Inicio de la Verificación:",{"$nulls":3},"Fecha de Término de la verificación"]
[null,null,{"$f":"IF(Resultados!$C$7=\"\",\"\",Resultados!$C$7)","v":"2021-07-07"},"2018-05-25",null,null,{"$f":"IF(Resultados!G7=\"\",\"\",Resultados!G7)","v":"2021-07-08"}]
[]
[null,null,"Criterios Sustantivos",null,{"$f":"IF(Aplicabilidad!G22<>\"SI\",\"NA\",(SUM(E19:E32)+SUM(E40:E53))/(SUM(D19:D32)+SUM(D40:D53)))","v":{"v":1,"d":"100%"}}]
[null,null,"Criterios Adjetivos",null,{"$f":"IF(Aplicabilidad!G22<>\"SI\",\"NA\",(SUM(E58:E66))/(SUM(D58:D66)))","v":{"v":1,"d":"100%"}}]
[null,null,"Obligación",null,{"$f":"IF(Aplicabilidad!G22<>\"SI\",\"NA\",E10*0.6+E11*0.4)","v":{"v":1,"d":"100.00%"}}]
[]
[]
[]
[null,null,"Criterios Sustantivos de contenido \nLTG 2018 - LTG 2020 (DOF 28/12/20) ",{"$f":"COUNTA(F19:F33)","v":0}]
[]
[null,null,"Criterio",null,"Valoración","Tipo","Observaciones, Recomendaciones y/o Requerimientos"]
[null,null,"Criterio 1. Ejercicio",{"$f":"IF(E19=\"Justificado\",0,1)","v":1},1]
[null,null,"Criterio 2. Periodo que se informa",{"$f":"IF(E20=\"Justificado\",0,1)","v":1},1]
[null,null,"Criterio 3. Tipo de contratación: régimen de servicios profesionales por honorarios o servicios profesionales por honorarios asimilados a salarios",1,1]
[null,null,"Criterio 4. Partida presupuestal de los recursos con que se cubran los honorarios pactados, con base en el Clasificador por Objeto del Gasto o Clasificador Contable que aplique",1,1]
[null,null,"Criterio 5. Nombre completo de la persona contratada (nombre[s], primer apellido, segundo apellido)",1,1]
[null,null,"Criterio 6. Número de contrato",1,1]
[null,null,"Criterio 7. Hipervínculo al contrato correspondiente",1,1]
[null,null,"Criterio 8. Fecha de inicio del contrato expresada con el formato día/mes/año (ej. 31/Marzo/2016)",1,1]
[null,null,"Criterio 9. Fecha de término del contrato expresada con el formato día/mes/año (ej. 31/Diciembre/2016)",1,1]
[null,null,"Criterio 10. Servicios contratados (objeto del contrato)",1,1]
[null,null,"Criterio 11. Remuneración mensual bruta o contraprestación",1,1]
[null,null,"Criterio 12. Monto total a pagar",1,1]
[null,null,"Criterio 13. Prestaciones, en su caso",{"$f":"IF(E31=\"Justificado\",0,1)","v":0},"Justificado"]
[null,null,"Criterio 14. Hipervínculo a la normatividad que regula la celebración de contratos de servicios profesionales por honorarios",{"$f":"IF(E32=\"Justificado\",0,1)","v":1},1]
[]
[]
[]
[]
[null,null,"Criterios Sustantivos de contenido LTG 2018 - LTG 2020 (DOF 28/12/20) ",{"$f":"COUNTA(F40:F66)","v":1}]
[]
[null,null,"Criterio",null,"Valoración","Tipo","Observaciones, Recomendaciones y/o Requerimientos"]
[null,null,"Criterio 1. Ejercicio",{"$f":"IF(E40=\"Justificado\",0,1)","v":1},1]
[null,null,"Criterio 2. Periodo que se informa (fecha de inicio y fecha de término con el formato día/mes/año)",{"$f":"IF(E41=\"Justificado\",0,1)","v":1},1]
[null,null,"Criterio 3. Tipo de contratación (catálogo): Servicios profesionales por honorarios / Servicios profesionales por honorarios asimilados a salarios",1,1]
[null,null,"Criterio 4. Partida presupuestal de los recursos con que se cubran los honorarios pactados, con base en el Clasificador por Objeto del Gasto o Clasificador Contable que aplique",1,1]
[null,null,"Criterio 5. Nombre completo de la persona contratada (nombre[s], primer apellido, segundo apellido)",1,1]
[null,null,"Criterio 6. Número de contrato",1,1]
[null,null,"Criterio 7. Hipervínculo al contrato correspondiente",1,1]
[null,null,"Criterio 8. Fecha de inicio del contrato expresada con el formato día/mes/año ",1,1]
[null,null,"Criterio 9. Fecha de término del contrato expresada con el formato día/mes/año ",1,1]
[null,null,"Criterio 10. Servicios contratados (objeto del contrato)",1,1]
[null,null,"Criterio 11. Remuneración mensual bruta o contraprestación",1,1]
[null,null,"Criterio 12. Monto total a pagar",1,1]
[null,null,"Criterio 13. Prestaciones, en su caso",{"$f":"IF(E52=\"Justificado\",0,1)","v":0},"Justificado"]
[null,null,"Criterio 14. Hipervínculo a la normatividad que regula la celebración de contratos de servicios profesionales por honorarios",{"$f":"IF(E53=\"Justificado\",0,1)","v":1},1]
[]
[null,null,"Criterios Adjetivos LTG 2018 - LTG 2020 (DOF 28/12/20) "]
[]
[null,null,"Criterio",null,"Valoración","Tipo","Observaciones, Recomendaciones y/o Requerimientos"]
[null,null,"Criterio 15. Periodo de actualización de la información: trimestral",{"$f":"IF(E58=\"Justificado\",0,1)","v":1},1]
[null,null,"Criterio 16. La información publicada deberá estar actualizada al periodo que corresponde de acuerdo con la Tabla de actualización y conservación de la información",1,1]
[null,null,"Criterio 17. Conservar en el sitio de Internet y a través de la Plataforma Nacional la Información del ejercicio en curso y la correspondiente al\nejercicio anterior",1,1]
[null,null,"Criterio 18. Área(s) responsable(s) que genera(n), posee(n), publica(n) y/o actualiza(n)la información ",1,1]
[null,null,"Criterio 19. Fecha de actualización de la información publicada con el formato día/mes/año ",1,1]
[null,null,"Criterio 20. Fecha de validación de la información publicada con el formato día/mes/año ",1,1]
[null,null,"Criterio 21. Nota. Este criterio se cumple en caso de que sea necesario que el sujeto obligado incluya alguna aclaración relativa a la información publicada y/o explicación por la falta de información",1,1]
[null,null,"Criterio 22. La información publicada se organiza mediante el formato 11, en el que se incluyen todos los campos especificados en los criterios sustantivos de contenido",1,1]
[null,null,"Criterio 23. El soporte de la información permite su reutilización",1,1]
{"$rows_empty":7}
[{"$nulls":3},2017,2018]
[null,null,"CS",{"$f":"IF(Aplicabilidad!G22<>\"SI\",\"NA\",SUM(E19:E32)/SUM(D19:D32))","v":{"v":1,"d":"100.00%"}},{"$f":"IF(Aplicabilidad!G22<>\"SI\",\"NA\",SUM(E40:E53)/SUM(D40:D53))","v":{"v":1,"d":"100.00%"}}]
[null,null,"CA",{"$f":"IF(Aplicabilidad!G22<>\"SI\",\"NA\",SUM(#REF!)/SUM(#REF!))","v":{"$error":"#REF!"}},{"$f":"IF(Aplicabilidad!G22<>\"SI\",\"NA\",SUM(E58:E66)/SUM(D58:D66))","v":{"v":1,"d":"100.00%"}}]
[null,null,"OBLIGACIÓN",{"$f":"IF(Aplicabilidad!G22<>\"SI\",\"NA\",D75*0.6+D76*0.4)","v":{"$error":"#REF!"}},{"$f":"IF(Aplicabilidad!G22<>\"SI\",\"NA\",E75*0.6+E76*0.4)","v":{"v":1,"d":"100.00%"}}]

{"sheet":"Art 74_XII","index":14,"n_rows":79,"n_cols":7,"rows_kept":79,"hidden":true,"merged":[[0,2,0,6],[4,1,4,7],[14,4,14,6],[41,4,41,6]]}
[null,null,{"$f":"IF(Aplicabilidad!E2=\"\",\"\",Aplicabilidad!E2)","v":"Consejería Jurídica"}]
[]
[null,"Códigos de valoración : Cumplió totalmente = 1; Cumplió parcialmente = 0.5; No cumplió = 0; Justificado = Justificado"]
[]
[null,"Art. 74 - Fracción XII. Declaraciones patrimoniales"]
[]
[null,null,"Fecha de Inicio de la Verificación:",{"$nulls":3},"Fecha de Término de la verificación"]
[null,null,{"$f":"IF(Resultados!$C$7=\"\",\"\",Resultados!$C$7)","v":"2021-07-07"},"2018-05-25",null,null,{"$f":"IF(Resultados!G7=\"\",\"\",Resultados!G7)","v":"2021-07-08"}]
[]
[null,null,"Criterios Sustantivos",null,{"$f":"IF(Aplicabilidad!G23<>\"SI\",\"NA\",(SUM(E19:E27)+SUM(E46:E55))/(SUM(D19:D27)+SUM(D46:D55)))","v":"NA"}]
[null,null,"Criterios Adjetivos",null,{"$f":"IF(Aplicabilidad!G23<>\"SI\",\"NA\",(SUM(E60:E68))/(SUM(D60:D68)))","v":"NA"}]
[null,null,"Obligación",null,{"$f":"IF(Aplicabilidad!G23<>\"SI\",\"NA\",E10*0.6+E11*0.4)","v":"NA"}]
[]
[]
[]
[null,null,"Criterios Sustantivos de contenido \nLTG 2018 - LTG 2020 (DOF 28/12/20) ",{"$f":"COUNTA(F19:F39)","v":1}]
[]
[null,null,"Criterio",null,"Valoración","Tipo","Observaciones, Recomendaciones y/o Requerimientos"]
[null,null,"Criterio 1. Ejercicio",{"$f":"IF(E19=\"Justificado\",0,1)","v":0},"Justificado"]
[null,null,"Criterio 2. Tipo de integrante del sujeto obligado (funcionario, servidor[a] público[a], empleado y/o toda persona que desempeñe un empleo, cargo o comisión y/o ejerza actos de autoridad, representante popular, miembro del poder judicial, miembro de órgano autónomo [especificar denominación], personal de confianza, prestador de servicios profesionales, otro [especificar denominación])",{"$f":"IF(E20=\"Justificado\",0,1)","v":0},"Justificado"]
[null,null,"Criterio 3. Clave o nivel del puesto [(en su caso] de acuerdo con el catálogo que regule la actividad del sujeto obligado)",0,"Justificado"]
[null,null,"Criterio 4. Denominación del puesto (de acuerdo con el catálogo que en su caso regule la actividad del sujeto obligado)",0,"Justificado"]
[null,null,"Criterio 5. Denominación del cargo (de conformidad con nombramiento otorgado)",0,"Justificado"]
[null,null,"Criterio 6. Área de adscripción (de acuerdo con el catálogo de unidades administrativas o puestos, si así corresponde)",0,"Justificado"]
[null,null,"Criterio 7. Nombre completo del/la servidor(a) público(a) y/o toda persona que desempeñe un empleo, cargo o comisión y/o ejerza actos de autoridad (nombre [s], primer apellido, segundo apellido)",0,"Justificado"]
[null,null,"Criterio 8. Modalidad de la Declaración de Situación Patrimonial: inicio / modificación / conclusión",{"$f":"IF(E26=\"Justificado\",0,1)","v":0},"Justificado"]
[null,null,"Criterio 9. Hipervínculo a la versión pública de la Declaración de Situación Patrimonial o a los sistemas habilitados que registren y resguarden las bases de datos correspondientes",{"$f":"IF(E27=\"Justificado\",0,1)","v":0},"Justificado"]
[]
[null,null,"Criterios Adjetivos LTG 2015-2017"]
[]
[null,null,"Criterio",null,"Valoración","Tipo","Observaciones, Recomendaciones y/o Requerimientos"]
[null,null,"Criterio 10. Periodo de actualización de la información: trimestral",{"$f":"IF(E32=\"Justificado\",0,1)","v":0},"Justificado"]
[null,null,"Criterio 11. La información publicada deberá estar actualizada al periodo que corresponde de acuerdo con la Tabla de actualización y conservación de la información",0,"Justificado"]
[null,null,"Criterio 12. Conservar en el sitio de Internet y a través de la Plataforma Nacional la información de acuerdo con la Tabla de actualización y conservación de la información",0,"Justificado"]
[null,null,"Criterio 13. Área(s) o unidad(es) administrativa(s) que genera(n) o posee(n) la información respectiva y son responsables de publicarla y actualizarla",0,"Justificado"]
[null,null,"Criterio 14. Fecha de actualización de la información publicada con el formato día/mes/año (por ej. 31/Marzo/2016)",0,"Justificado"]
[null,null,"Criterio 15. Fecha de validación de la información publicada con el formato día/mes/año (por ej. 31/Marzo/2016)",0,"Justificado"]
[null,null,"Criterio 16. La información publicada se organiza mediante el formato 12, en el que se incluyen todos los campos especificados en los criterios sustantivos de contenido",0,"Justificado"]
[null,null,"Criterio 17. El soporte de la información permite su reutilización",0,"Justificado"]
[]
[]
[]
[null,null,"Criterios Sustantivos de contenido\n LTG 2018 - LTG 2020 (DOF 28/12/20) ",{"$f":"COUNTA(F46:F68)","v":1}]
[]
[null,null,"Criterio",null,"Valoración","Tipo","Observaciones, Recomendaciones y/o Requerimientos"]
[null,null,"Criterio 1. Ejercicio",{"$f":"IF(E46=\"Justificado\",0,1)","v":1}]
[null,null,"Criterio 2. Periodo que se informa (fecha de inicio y fecha de término con el formato día/mes/año)",{"$f":"IF(E47=\"Justificado\",0,1)","v":1}]
[null,null,"Criterio 3. Tipo de integrante del sujeto obligado (catálogo):  funcionario/servidor[a] público[a]/ servidor[a] público[a] eventual/integrante/empleado/representante popular/ miembro del poder judicial/miembro de órgano autónomo/personal de confianza/prestador de servicios profesionales/otro",1]
[null,null,"Criterio 4. Clave o nivel del puesto [(en su caso] de acuerdo con el catálogo que regule la actividad del sujeto obligado)",1]
[null,null,"Criterio 5. Denominación del puesto (de acuerdo con el catálogo que en su caso regule la actividad del sujeto obligado)",1]
[null,null,"Criterio 6. Denominación del cargo (de conformidad con nombramiento otorgado)",1]
[null,null,"Criterio 7. Área de adscripción (de acuerdo con el catálogo que en su caso regule la actividad del sujeto obligado)",1]
[null,null,"Criterio 8. Nombre completo del(la) servidor(a) público(a) y/o toda persona que desempeñe un empleo, cargo o comisión y/o ejerza actos de autoridad (nombre [s], primer apellido, segundo apellido)",1]
[null,null,"Criterio 9. Modalidad de la Declaración de Situación Patrimonial (catálogo): Inicio/Modificación/Conclusión",{"$f":"IF(E54=\"Justificado\",0,1)","v":1}]
[null,null,"Criterio 10. Hipervínculo a la versión pública de la Declaración de Situación Patrimonial o a los sistemas habilitados que registren y resguarden las bases de datos correspondientes",{"$f":"IF(E55=\"Justificado\",0,1)","v":1}]
[]
[null,null,"Criterios Adjetivos LTG 2018 - LTG 2020 (DOF 28/12/20) "]
[]
[null,null,"Criterio",null,"Valoración","Tipo","Observaciones, Recomendaciones y/o Requerimientos"]
[null,null,"Criterio 11. Periodo de actualización de la información: trimestral",{"$f":"IF(E60=\"Justificado\",0,1)","v":1}]
[null,null,"Criterio 12. La información publicada deberá estar actualizada al periodo que corresponde de acuerdo con la Tabla de actualización y conservación de la información",1]
[null,null,"Criterio 13. Conservar en el sitio de Internet y a través de la Plataforma Nacional la Información del ejercicio en curso y la correspondiente al\nejercicio anterior",1]
[null,null,"Criterio 14. Área(s) responsable(s) que genera(n), posee(n), publica(n) y/o actualiza(n)la información ",1]
[null,null,"Criterio 15. Fecha de actualización de la información publicada con el formato día/mes/año ",1]
[null,null,"Criterio 16. Fecha de validación de la información publicada con el formato día/mes/año ",1]
[null,null,"Criterio 17. Nota. Este criterio se cumple en caso de que sea necesario que el sujeto obligado incluya alguna aclaración relativa a la información publicada y/o explicación por la falta de información ",1]
[null,null,"Criterio 18. La información publicada se organiza mediante el formato 12, en el que se incluyen todos los campos especificados en los criterios sustantivos de contenido",1]
[null,null,"Criterio 19. El soporte de la información permite su reutilización",1]
{"$rows_empty":7}
[{"$nulls":3},2017,2018]
[null,null,"CS",{"$f":"IF(Aplicabilidad!G23<>\"SI\",\"NA\",SUM(E19:E27)/SUM(D19:D27))","v":"NA"},{"$f":"IF(Aplicabilidad!G23<>\"SI\",\"NA\",SUM(E46:E55)/SUM(D46:D55))","v":"NA"}]
[null,null,"CA",{"$f":"IF(Aplicabilidad!G23<>\"SI\",\"NA\",SUM(E32:E39)/SUM(D32:D39))","v":"NA"},{"$f":"IF(Aplicabilidad!G23<>\"SI\",\"NA\",SUM(E60:E68)/SUM(D60:D68))","v":"NA"}]
[null,null,"OBLIGACIÓN",{"$f":"IF(Aplicabilidad!G23<>\"SI\",\"NA\",D77*0.6+D78*0.4)","v":"NA"},{"$f":"IF(Aplicabilidad!G23<>\"SI\",\"NA\",E77*0.6+E78*0.4)","v":"NA"}]

{"sheet":"Art 74_XIII","index":15,"n_rows":53,"n_cols":7,"rows_kept":53,"hidden":true,"merged":[[0,2,0,6],[4,1,4,7],[14,4,14,6]]}
[null,null,{"$f":"IF(Aplicabilidad!E2=\"\",\"\",Aplicabilidad!E2)","v":"Consejería Jurídica"}]
[]
[null,"Códigos de valoración : Cumplió totalmente = 1; Cumplió parcialmente = 0.5; No cumplió = 0; Justificado = Justificado"]
[]
[null,"Art. 74 - Fracción XIII. Datos de Unidad de Transparencia"]
[]
[null,null,"Fecha de Inicio de la Verificación:",{"$nulls":3},"Fecha de Término de la verificación"]
[null,null,{"$f":"IF(Resultados!$C$7=\"\",\"\",Resultados!$C$7)","v":"2021-07-07"},"2018-05-25",null,null,{"$f":"IF(Resultados!G7=\"\",\"\",Resultados!G7)","v":"2021-07-08"}]
[]
[null,null,"Criterios Sustantivos",null,{"$f":"IF(Aplicabilidad!G24<>\"SI\",\"NA\",(+SUM(E19:E29))/(+SUM(D19:D29)))","v":"NA"}]
[null,null,"Criterios Adjetivos",null,{"$f":"IF(Aplicabilidad!G24<>\"SI\",\"NA\",(+SUM(E34:E42))/(+SUM(D34:D42)))","v":"NA"}]
[null,null,"Obligación",null,{"$f":"IF(Aplicabilidad!G24<>\"SI\",\"NA\",E10*0.6+E11*0.4)","v":"NA"}]
[]
[]
[]
[null,null,"Criterios Sustantivos de contenido \nLTG 2018 - LTG 2020 (DOF 28/12/20) ",{"$f":"COUNTA(F19:F42)","v":1}]
[]
[null,null,"Criterio",null,"Valoración","Tipo","Observaciones, Recomendaciones y/o Requerimientos"]
[null,null,"Criterio 1. Ejercicio",{"$f":"IF(E19=\"Justificado\",0,1)","v":1}]
[null,null,"Criterio 2. Periodo que se informa (fecha de inicio y fecha de término con el formato día/mes/año)",{"$f":"IF(E20=\"Justificado\",0,1)","v":1}]
[null,null,"Criterio 3. Domicilio oficial de la Unidad de Transparencia (tipo de vialidad [catálogo], nombre de vialidad [calle], número exterior, número interior [en su caso], Tipo de asentamiento humano [catálogo], nombre de asentamiento humano [colonia], Clave de la localidad, nombre de la localidad, clave del municipio, nombre del municipio o delegación, clave de la entidad federativa, nombre de la entidad federativa [catálogo], código postal)",1]
[null,null,"Criterio 4. Teléfono(s) oficial(es) y, en su caso, extensión(es)",1]
[null,null,"Criterio 5. Horario de atención de la Unidad de Transparencia",1]
[null,null,"Criterio 6. Correo electrónico oficial activo de la Unidad de Transparencia mediante el cual se recibirán las solicitudes de información",1]
[null,null,"Criterio 7. Nota que indique que se reciben solicitudes de información pública. Ejemplo: “Se reciben solicitudes de información pública respecto a <<sujeto obligado>>, a través del correo electrónico oficial de la Unidad de Transparencia, en el domicilio oficial de ésta, vía telefónica, por correo postal, mensajería, telégrafo, verbalmente ante el personal habilitado que las capturará en el sistema electrónico de solicitudes; o cualquier medio aprobado por el Sistema Nacional”",1]
[null,null,"Criterio 8. Hipervínculo a la dirección electrónica del Sistema de solicitudes de acceso a la información",1]
[null,null,"Criterio 9. Nombres completos del(la) responsable de la Unidad de Transparencia y del personal habilitado para cumplir con las funciones establecidas en el artículo 45 de la Ley General, independientemente de que su nivel sea menor al de jefe de departamento u homólogo (nombre[s], primer apellido, segundo apellido)",1]
[null,null,"Criterio 10. Cargo o puesto que ocupan el(la) responsable de la Unidad de Transparencia y el personal habilitado para cumplir con las funciones establecidas en el artículo 45 de la Ley General en el sujeto obligado",{"$f":"IF(E28=\"Justificado\",0,1)","v":1}]
[null,null,"Criterio 11. Función que desempeña el personal asignado en la Unidad de Transparencia",{"$f":"IF(E29=\"Justificado\",0,1)","v":1}]
[]
[null,null,"Criterios Adjetivos LTG 2018 - LTG 2020 (DOF 28/12/20) "]
[]
[null,null,"Criterio",null,"Valoración","Tipo","Observaciones, Recomendaciones y/o Requerimientos"]
[null,null,"Criterio 12. Periodo de actualización de la información: trimestral. En su caso, 15 días hábiles después de una modificación",{"$f":"IF(E34=\"Justificado\",0,1)","v":1}]
[null,null,"Criterio 13. La información publicada deberá estar actualizada al periodo que corresponde de acuerdo con la Tabla de actualización y conservación de la información",1]
[null,null,"Criterio 14. Conservar en el sitio de Internet y a través de la Plataforma Nacional la información vigente de acuerdo con la Tabla de actualización y conservación de la información",1]
[null,null,"Criterio 15. Área(s) responsable(s) que genera(n), posee(n), publica(n) y/o actualiza(n)la información ",1]
[null,null,"Criterio 16. Fecha de actualización de la información publicada con el formato día/mes/año ",1]
[null,null,"Criterio 17. Fecha de validación de la información publicada con el formato día/mes/año ",1]
[null,null,"Criterio 18. Nota. Este criterio se cumple en caso de que sea necesario que el sujeto obligado incluya alguna aclaración relativa a la información publicada y/o explicación por la falta de información ",1]
[null,null,"Criterio 19. La información publicada se organiza mediante el formato 13, en el que se incluyen todos los campos especificados en los criterios sustantivos de contenido",1]
[null,null,"Criterio 20. El soporte de la información permite su reutilización",1]
{"$rows_empty":7}
[{"$nulls":3},2017,2018]
[null,null,"CS","NA",{"$f":"IF(Aplicabilidad!G24<>\"SI\",\"NA\",SUM(E19:E29)/SUM(D19:D29))","v":"NA"}]
[null,null,"CA","NA",{"$f":"IF(Aplicabilidad!G24<>\"SI\",\"NA\",SUM(E34:E42)/SUM(D34:D42))","v":"NA"}]
[null,null,"OBLIGACIÓN","NA",{"$f":"IF(Aplicabilidad!G24<>\"SI\",\"NA\",E51*0.6+E52*0.4)","v":"NA"}]

{"sheet":"Art 74_XIV","index":16,"n_rows":61,"n_cols":7,"rows_kept":61,"hidden":true,"merged":[[0,2,0,6],[4,1,4,7],[14,4,14,6]]}
[null,null,{"$f":"IF(Aplicabilidad!E2=\"\",\"\",Aplicabilidad!E2)","v":"Consejería Jurídica"}]
[]
[null,"Códigos de valoración : Cumplió totalmente = 1; Cumplió parcialmente = 0.5; No cumplió = 0; Justificado = Justificado"]
[]
[null,"Art. 74 - Fracción XIV. Concursos para ocupar cargos"]
[]
[null,null,"Fecha de Inicio de la Verificación:",{"$nulls":3},"Fecha de Término de la verificación"]
[null,null,{"$f":"IF(Resultados!$C$7=\"\",\"\",Resultados!$C$7)","v":"2021-07-07"},"2018-05-25",null,null,{"$f":"IF(Resultados!G7=\"\",\"\",Resultados!G7)","v":"2021-07-08"}]
[]
[null,null,"Criterios Sustantivos",null,{"$f":"IF(Aplicabilidad!G25<>\"SI\",\"NA\",(+SUM(E19:E37))/(+SUM(D19:D37)))","v":"NA"}]
[null,null,"Criterios Adjetivos",null,{"$f":"IF(Aplicabilidad!G25<>\"SI\",\"NA\",(+SUM(E42:E50))/(+SUM(D42:D50)))","v":"NA"}]
[null,null,"Obligación",null,{"$f":"IF(Aplicabilidad!G25<>\"SI\",\"NA\",E10*0.6+E11*0.4)","v":"NA"}]
[]
[]
[]
[null,null,"Criterios Sustantivos de contenido \nLTG 2018 - LTG 2020 (DOF 28/12/20) ",{"$f":"COUNTA(F19:F50)","v":1}]
[]
[null,null,"Criterio",null,"Valoración","Tipo","Observaciones, Recomendaciones y/o Requerimientos"]
[null,null,"Criterio 1. Ejercicio",{"$f":"IF(E19=\"Justificado\",0,1)","v":1}]
[null,null,"Criterio 2. Periodo que se informa (fecha de inicio y fecha de término con el formato día/mes/año)",{"$f":"IF(E20=\"Justificado\",0,1)","v":1}]
[null,null,"Criterio 3. Tipo de evento (catálogo): concurso/convocatoria/invitación/aviso",1]
[null,null,"Criterio 4. Alcance del concurso (catálogo): Abierto al público en general/Abierto sólo a servidores(as) públicos(as) del sujeto obligado",1]
[null,null,"Criterio 5. Tipo de cargo o puesto (catálogo): Confianza/Base/Otro ",1]
[null,null,"Criterio 6. Clave o nivel del puesto (de acuerdo con el catálogo de claves y niveles de puesto de cada sujeto obligado)",1]
[null,null,"Criterio 7. Denominación del puesto (de acuerdo con el catálogo que en su caso regule la actividad del sujeto obligado)",1]
[null,null,"Criterio 8. Denominación del cargo de conformidad con nombramiento otorgado",1]
[null,null,"Criterio 9. Denominación del Área (de acuerdo con el catálogo que en su caso regule la actividad del sujeto obligado)",1]
[null,null,"Criterio 10. Salario bruto mensual",1]
[null,null,"Criterio 11. Salario neto mensual",1]
[null,null,"Criterio 12. Fecha de publicación del concurso, convocatoria, invitación y/o aviso con el formato día/mes/año ",1]
[null,null,"Criterio 13. Número de la convocatoria",1]
[null,null,"Criterio 14. Hipervínculo al documento de la convocatoria, invitación y/o aviso en el que se indique la información necesaria para participar, entre otras: funciones a realizar, perfil del puesto, requisitos para participar, documentación solicitada, cómo y dónde registrarse, fases y fechas del proceso de selección, guías para evaluaciones",1]
[null,null,"Criterio 15. Estado del proceso del concurso, convocatoria, invitación y/o aviso (catálogo): En proceso/En evaluación/Finalizado/ Cancelado/ Desierto",1]
[null,null,"Criterio 16. Número total de candidatos registrados",1]
[null,null,"Criterio 17. Nombre(s), primer apellido, segundo apellido de la persona aceptada/contratada para ocupar la plaza, cargo, puesto o función",1]
[null,null,"Criterio 18. Hipervínculo a la versión pública del acta o documento que asigne al(la) ganador(a)",{"$f":"IF(E36=\"Justificado\",0,1)","v":1}]
[null,null,"Criterio 19. En su caso, hipervínculo al sistema electrónico de convocatorias y/o concursos correspondiente al sujeto obligado y el hipervínculo al mismo",{"$f":"IF(E37=\"Justificado\",0,1)","v":1}]
[]
[null,null,"Criterios Adjetivos LTG 2018 - LTG 2020 (DOF 28/12/20) "]
[]
[null,null,"Criterio",null,"Valoración","Tipo","Observaciones, Recomendaciones y/o Requerimientos"]
[null,null,"Criterio 20. Periodo de actualización de la información: trimestral. En su caso, se actualizará la información, previo a la fecha de vencimiento de las convocatorias para ocupar cargos públicos; de conformidad con la normativa aplicable al sujeto obligado",{"$f":"IF(E42=\"Justificado\",0,1)","v":1}]
[null,null,"Criterio 21. La información publicada deberá estar actualizada al periodo que corresponde de acuerdo con la Tabla de actualización y conservación de la información",1]
[null,null,"Criterio 22. Conservar en el sitio de Internet y a través de la Plataforma Nacional la Información vigente y del ejercicio en curso",1]
[null,null,"Criterio 23. Área(s) responsable(s) que genera(n), posee(n), publica(n) y/o actualiza(n)la información ",1]
[null,null,"Criterio 24. Fecha de actualización de la información publicada con el formato día/mes/año ",1]
[null,null,"Criterio 25. Fecha de validación de la información publicada con el formato día/mes/año ",1]
[null,null,"Criterio 26. Nota. Este criterio se cumple en caso de que sea necesario que el sujeto obligado incluya alguna aclaración relativa a la información publicada y/o explicación por la falta de información",1]
[null,null,"Criterio 27. La información publicada se organiza mediante el formato 14 en el que se incluyen todos los campos especificados en los criterios sustantivos de contenido",1]
[null,null,"Criterio 28. El soporte de la información permite su reutilización",1]
{"$rows_empty":7}
[{"$nulls":3},2017,2018]
[null,null,"CS","NA",{"$f":"IF(Aplicabilidad!G25<>\"SI\",\"NA\",SUM(E19:E37)/SUM(D19:D37))","v":"NA"}]
[null,null,"CA","NA",{"$f":"IF(Aplicabilidad!G25<>\"SI\",\"NA\",SUM(E42:E50)/SUM(D42:D50))","v":"NA"}]
[null,null,"OBLIGACIÓN","NA",{"$f":"IF(Aplicabilidad!G25<>\"SI\",\"NA\",E59*0.6+E60*0.4)","v":"NA"}]

{"sheet":"Art 74_XV","index":17,"n_rows":178,"n_cols":7,"rows_kept":178,"hidden":true,"merged":[[0,2,0,6],[4,1,4,7],[14,4,14,6],[78,4,78,6]]}
[null,null,{"$f":"IF(Aplicabilidad!E2=\"\",\"\",Aplicabilidad!E2)","v":"Consejería Jurídica"}]
[]
[null,"Códigos de valoración : Cumplió totalmente = 1; Cumplió parcialmente = 0.5; No cumplió = 0; Justificado = Justificado"]
[]
[null,"Art. 74 - Fracción XV. Programas sociales"]
[]
[null,null,"Fecha de Inicio de la Verificación:",{"$nulls":3},"Fecha de Término de la verificación"]
[null,null,{"$f":"IF(Resultados!$C$7=\"\",\"\",Resultados!$C$7)","v":"2021-07-07"},"2018-05-25",null,null,{"$f":"IF(Resultados!G7=\"\",\"\",Resultados!G7)","v":"2021-07-08"}]
[]
[null,null,"Criterios Sustantivos",null,{"$f":"IF(Aplicabilidad!G26<>\"SI\",\"NA\",(SUM(E19:E75)+SUM(E83:E154))/(SUM(D19:D75)+SUM(D83:D154)))","v":"NA"}]
[null,null,"Criterios Adjetivos",null,{"$f":"IF(Aplicabilidad!G26<>\"SI\",\"NA\",(SUM(E159:E167))/(SUM(D159:D167)))","v":"NA"}]
[null,null,"Obligación",null,{"$f":"IF(Aplicabilidad!G26<>\"SI\",\"NA\",E10*0.6+E11*0.4)","v":"NA"}]
[]
[]
[]
[null,null,"Criterios Sustantivos de contenido \nLTG 2018 - LTG 2020 (DOF 28/12/20) ",{"$f":"COUNTA(F19:F76)","v":0}]
[]
[null,null,"Criterio",null,"Valoración","Tipo","Observaciones, Recomendaciones y/o Requerimientos"]
[null,null,"Criterio 1. Tipo de programa: Programas de transferencia, Programas de servicios, Programas de infraestructura social, Programas de subsidio o Mixto",{"$f":"IF(E19=\"Justificado\",0,1)","v":0},"Justificado"]
[null,null,"Criterio 2. Ejercicio",{"$f":"IF(E20=\"Justificado\",0,1)","v":0},"Justificado"]
[null,null,"Criterio 3. El programa es desarrollado por más de un área o sujeto obligado (Sí / No)",0,"Justificado"]
[null,null,"Criterio 4. Sujeto(s) obligado(s), en su caso, corresponsable(s) del programa",0,"Justificado"]
[null,null,"Criterio 5. Área(s) (de acuerdo con el catálogo que en su caso regule la actividad del sujeto obligado) o unidad(es) responsable(s) del desarrollo del programa",0,"Justificado"]
[null,null,"Criterio 6. Denominación del programa",0,"Justificado"]
[null,null,"Criterio 7. En su caso, la denominación del documento normativo en el cual se especifique la creación del programa: Ley / Lineamiento / Convenio / Otro (especificar)",0,"Justificado"]
[null,null,"Criterio 8. Hipervínculo al documento normativo en el cual se especifica la creación del programa",0,"Justificado"]
[null,null,"Criterio 9. Periodo de vigencia o ciclo correspondiente al programa llevado a cabo (fecha de inicio y fecha de término publicada con el formato día/mes/año [por ej. 31/Marzo/2016])",0,"Justificado"]
[null,null,"Criterio 10. Diseño",0,"Justificado"]
[null,null,"Criterio 11. Objetivos (generales y específicos)",0,"Justificado"]
[null,null,"Criterio 12. Alcances (corto, mediano o largo plazo)",0,"Justificado"]
[null,null,"Criterio 13. Metas físicas",0,"Justificado"]
[null,null,"Criterio 14. Población beneficiada estimada (número de personas)",0,"Justificado"]
[null,null,"Criterio 15. Nota metodológica de cálculo (en caso de tratarse de una estimación)",0,"Justificado"]
[null,null,"Criterio 16. Monto del presupuesto aprobado",0,"Justificado"]
[null,null,"Criterio 17. Monto del presupuesto modificado",0,"Justificado"]
[null,null,"Criterio 18. Monto del presupuesto ejercido",0,"Justificado"]
[null,null,"Criterio 19. Monto destinado a cubrir el déficit de operación",0,"Justificado"]
[null,null,"Criterio 20. Monto destinado a cubrir los gastos de administración asociados con el otorgamiento de subsidios de las entidades y órganos administrativos desconcentrados",0,"Justificado"]
[null,null,"Criterio 21. Hipervínculo, en su caso, al documento donde se establezcan las modificaciones a los alcances o modalidades del programa",0,"Justificado"]
[null,null,"Criterio 22. Hipervínculo al Calendario de su programación presupuestal",0,"Justificado"]
[null,null,"Criterio 23. Criterios de elegibilidad previstos",0,"Justificado"]
[null,null,"Criterio 24. Requisitos y procedimientos de acceso",0,"Justificado"]
[null,null,"Criterio 25. Monto, apoyo o beneficio (en dinero o en especie) mínimo que recibirá(n) el(los) beneficiario(s)",0,"Justificado"]
[null,null,"Criterio 26. Monto, apoyo o beneficio (en dinero o en especie) máximo que recibirá(n) el(los) beneficiario(s)",0,"Justificado"]
[null,null,"Criterio 27. Procedimiento de queja o inconformidad ciudadana",0,"Justificado"]
[null,null,"Criterio 28. Mecanismos de exigibilidad",0,"Justificado"]
[null,null,"Criterio 29. Mecanismos de cancelación de apoyo, en su caso",0,"Justificado"]
[null,null,"Criterio 30. Periodo que se informa",0,"Justificado"]
[null,null,"Criterio 31. Mecanismos de evaluación",0,"Justificado"]
[null,null,"Criterio 32. Instancia(s) evaluadora(s)",0,"Justificado"]
[null,null,"Criterio 33. Hipervínculo a los Resultados de los informes de evaluación",0,"Justificado"]
[null,null,"Criterio 34. Seguimiento que ha dado el sujeto obligado a las recomendaciones que en su caso se hayan emitido",0,"Justificado"]
[null,null,"Criterio 35. Denominación del indicador",0,"Justificado"]
[null,null,"Criterio 36. Definición",0,"Justificado"]
[null,null,"Criterio 37. Método de cálculo (fórmula)",0,"Justificado"]
[null,null,"Criterio 38. Unidad de medida",0,"Justificado"]
[null,null,"Criterio 39. Dimensión (eficiencia, eficacia, economía, calidad)",0,"Justificado"]
[null,null,"Criterio 40. Frecuencia de medición",0,"Justificado"]
[null,null,"Criterio 41. Resultados",0,"Justificado"]
[null,null,"Criterio 42. Denominación del documento, metodología, base de datos o documento que corresponda en el cual se basaron para medir y/o generar el indicador utilizado",0,"Justificado"]
[null,null,"Criterio 43. Formas de participación social",0,"Justificado"]
[null,null,"Criterio 44. Articulación con otros programas sociales (Sí / No)",0,"Justificado"]
[null,null,"Criterio 45. Denominación del(los) programa(s) al(los) cual(es) está articulado",0,"Justificado"]
[null,null,"Criterio 46. Está sujeto a Reglas de Operación (Sí / No)",0,"Justificado"]
[null,null,"Criterio 47. Hipervínculo al documento de Reglas de Operación, publicado en el DOF, gaceta, periódico o documento equivalente",0,"Justificado"]
[null,null,"Criterio 48. Hipervínculo a los informes periódicos sobre la ejecución del programa",0,"Justificado"]
[null,null,"Criterio 49. Hipervínculo al resultados de las evaluaciones realizadas a dichos informes",0,"Justificado"]
[null,null,"Criterio 50. Fecha de publicación, en el DOF gaceta, periódico o documento equivalente, de las evaluaciones realizadas a los programas con el formato día/mes/año (por ej. 31/Marzo/2016)",0,"Justificado"]
[null,null,"Criterio 51. Hipervínculo al padrón de beneficiarios o participantes. Deberá publicarse en un documento explotable y constituido con los siguientes campos:",0,"Justificado"]
[null,null,"Criterio 52. Nombre de la persona física (nombre[s], primer apellido, segundo apellido), denominación social de las personas morales beneficiarias o denominación (en su caso) de un grupo constituido por varias personas físicas o morales, de acuerdo con la identificación que el sujeto obligado le otorgue[6]",0,"Justificado"]
[null,null,"Criterio 53. Monto (en pesos), recurso, beneficio o apoyo (en dinero o en especie) otorgado a cada una de las personas físicas, morales o grupos que el sujeto obligado determine",0,"Justificado"]
[null,null,"Criterio 54. Unidad territorial (colonia, municipio, delegación, estado y/o país)",0,"Justificado"]
[null,null,"Criterio 55. Edad (en su caso)",0,"Justificado"]
[null,null,"Criterio 56. Sexo (en su caso)",{"$f":"IF(E74=\"Justificado\",0,1)","v":0},"Justificado"]
[null,null,"Criterio 57. Hipervínculo a información estadística general de las personas beneficiadas por el programa",{"$f":"IF(E75=\"Justificado\",0,1)","v":0},"Justificado"]
[]
[]
[]
[]
[null,null,"Criterios Sustantivos de contenido LTG 2018 - LTG 2020 (DOF 28/12/20) ",{"$f":"COUNTA(F83:F167)","v":1}]
[]
[null,null,"Criterio",null,"Valoración","Tipo","Observaciones, Recomendaciones y/o Requerimientos"]
[null,null,"Criterio 1 . Ejercicio",{"$f":"IF(E83=\"Justificado\",0,1)","v":1}]
[null,null,"Criterio 2 . Periodo que se informa (fecha de inicio y fecha de término con el formato día/mes/año)",{"$f":"IF(E84=\"Justificado\",0,1)","v":1}]
[null,null,"Criterio 3. Ámbito (Catálogo): Local/Federal (Criterio adicionado DOF 28/12/2020)",1]
[null,null,"Criterio 4. Tipo de programa (catálogo): Programa de transferencia/Programa de servicios/Programa de infraestructura social/Programa de subsidio/Programa mixto",1]
[null,null,"Criterio 5. Denominación del programa",1]
[null,null,"Criterio 6. Denominación del subprograma, vertiente o modalidad a la que pertenece el beneficiario, en su caso.  (Criterio adicionado DOF 28/12/2020)",1]
[null,null,"Criterio 7. El programa es desarrollado por más de un área o sujeto obligado (catálogo): Sí/No",1]
[null,null,"Criterio 8. Sujeto(s) obligado(s), en su caso, corresponsable(s) del programa",1]
[null,null,"Criterio 9. Área(s) (de acuerdo con el catálogo que en su caso regule la actividad del sujeto obligado) responsable(s) del desarrollo del programa",1]
[null,null,"Criterio 10. Denominación del documento normativo en el cual se especifique la creación del programa",1]
[null,null,"Criterio 11. Hipervínculo al documento normativo en el cual se especifique la creación del programa",1]
[null,null,"Criterio 12. El periodo de vigencia del programa está definido (catálogo):  Sí/No",1]
[null,null,"Criterio 13. Fecha de inicio de vigencia del programa llevado a cabo (con el formato día/mes/año) ",1]
[null,null,"Criterio 14 . Fecha de término de vigencia del programa llevado a cabo (con el formato día/mes/año) ",1]
[null,null,"Criterio 15. Diseño",1]
[null,null,"Criterio 16. Objetivo(s) general(es)",1]
[null,null,"Criterio 17. Objetivo(s) específico(s)",1]
[null,null,"Criterio 18. Alcances (catálogo): Corto plazo/Mediano plazo/Largo plazo/Permanente",1]
[null,null,"Criterio 19. Metas físicas",1]
[null,null,"Criterio 20. Población beneficiada estimada (número de personas)",1]
[null,null,"Criterio 21. Nota metodológica de cálculo (en caso de tratarse de una estimación)",1]
[null,null,"Criterio 22. Monto del presupuesto aprobado",1]
[null,null,"Criterio 23. Monto del presupuesto modificado",1]
[null,null,"Criterio 24. Monto del presupuesto ejercido",1]
[null,null,"Criterio 25. Monto destinado a cubrir el déficit de operación",1]
[null,null,"Criterio 26. Monto destinado a cubrir los gastos de administración asociados con el otorgamiento de subsidios de las entidades y órganos administrativos desconcentrados",1]
[null,null,"Criterio 27. Hipervínculo, en su caso, al documento donde se establezcan las modificaciones a los alcances o modalidades del programa",1]
[null,null,"Criterio 28. Hipervínculo al Calendario de su programación presupuestal",1]
[null,null,"Criterio 29. Criterios de elegibilidad previstos",1]
[null,null,"Criterio 30. Requisitos y procedimientos de acceso",1]
[null,null,"Criterio 31. Monto, apoyo o beneficio (en dinero o en especie) mínimo que recibirá(n) el(los) beneficiario(s)",1]
[null,null,"Criterio 32. Monto, apoyo o beneficio (en dinero o en especie) máximo que recibirá(n) el(los) beneficiario(s)",1]
[null,null,"Criterio 33. Procedimiento de queja o inconformidad ciudadana",1]
[null,null,"Criterio 34. Mecanismos de exigibilidad",1]
[null,null,"Criterio 35. Mecanismos de cancelación de apoyo, en su caso",1]
[null,null,"Criterio 36. Periodo evaluado",1]
[null,null,"Criterio 37. Mecanismos de evaluación",1]
[null,null,"Criterio 38. Instancia(s) evaluadora(s)",1]
[null,null,"Criterio 39. Hipervínculo a los Informes de resultados de la evaluación",1]
[null,null,"Criterio 40. Seguimiento que ha dado el sujeto obligado a las recomendaciones que en su caso se hayan emitido",1]
[null,null,"Criterio 41. Denominación del indicador",1]
[null,null,"Criterio 42. Definición",1]
[null,null,"Criterio 43. Método de cálculo (fórmula)",1]
[null,null,"Criterio 44. Unidad de medida",1]
[null,null,"Criterio 45. Dimensión (catálogo): eficiencia/eficacia/ economía/calidad",1]
[null,null,"Criterio 46. Frecuencia de medición",1]
[null,null,"Criterio 47. Resultados",1]
[null,null,"Criterio 48. Denominación del documento, metodología, base de datos o documento que corresponda en el cual se basaron para medir y/o generar el indicador utilizado",1]
[null,null,"Criterio 49. Formas de participación social",1]
[null,null,"Criterio 50. Articulación con otros programas sociales (catálogo): Sí/No",1]
[null,null,"Criterio 51. Denominación del(los) programa(s) al(los) cual(es) está articulado",1]
[null,null,"Criterio 52. Está sujeto a Reglas de Operación (catálogo): Sí/No",1]
[null,null,"Criterio 53. Hipervínculo al documento de Reglas de Operación, publicado en el DOF, gaceta, periódico o documento equivalente",1]
[null,null,"Criterio 54. Hipervínculo a los informes periódicos sobre la ejecución del programa",1]
[null,null,"Criterio 55. Hipervínculo al resultado de las evaluaciones realizadas a dichos informes",1]
[null,null,"Criterio 56. Fecha de publicación, en el DOF, gaceta, periódico o documento equivalente, de las evaluaciones realizadas a los programas (con el formato día/mes/año).",1]
[null,null,"Criterio 57. Hipervínculo al padrón de beneficiarios o participantes. Este documento deberá ser el publicado en el DOF, Gaceta o cualquier medio oficial según corresponda",1]
[null,null,"Criterio 58. Hipervínculo al Padrón de Beneficiarios de programas de desarrollo social federal elaborado y publicado por la Secretaría del Bienestar (Criterio adicionado DOF 28/12/2020)",1]
[null,null,"Criterio 59. Ejercicio",1]
[null,null,"Criterio 60. Periodo que se informa (fecha de inicio y fecha de término con el formato día/mes/año)",1]
[null,null,"Criterio 61. Ámbito (Catálogo): Local/Federal (Criterio adicionado DOF 28/12/2020)",1]
[null,null,"Criterio 62. Tipo de programa (catálogo): Programa de transferencia/ Programa de servicios/ Programa de infraestructura social/ Programa de subsidio/ Programa mixto",1]
[null,null,"Criterio 63. Denominación del programa",1]
[null,null,"Criterio 64. Denominación del subprograma, vertiente o modalidad a la que pertenece el beneficiario, en su caso.  (Criterio adicionado DOF 28/12/2020)",1]
[null,null,"Criterio 65. Nombre de la persona física (nombre[s], primer apellido, segundo apellido), denominación social de las personas morales beneficiarias o denominación (en su caso) de un grupo constituido por varias personas físicas o morales, de acuerdo con la identificación que el sujeto obligado le otorgue",1]
[null,null,"Criterio 66. Fecha en que la persona se volvió beneficiaria del programa (con el formato día/mes/año)  (Criterio adicionado DOF 28/12/2020)",{"$f":"IF(E148=\"Justificado\",0,1)","v":1}]
[null,null,"Criterio 67. Monto, recurso, beneficio o apoyo (en dinero o en especie) otorgado a cada una de las personas físicas, morales o grupos que el sujeto obligado determine",1]
[null,null,"Criterio 68.  Monto en pesos del beneficio o apoyo en especie entregado a cada una de las personas físicas, morales o grupos que el sujeto obligado determine si el\nBeneficio no tiene representación monetaria  (Criterio adicionado DOF 28/12/2020)",1]
[null,null,"Criterio 69. Unidad territorial (colonia, municipio, delegación, estado y/o país)",1]
[null,null,"Criterio 70. Edad (en su caso)",1]
[null,null,"Criterio 71. Sexo, en su caso (catálogo): Femenino/ Masculino",1]
[null,null,"Criterio 72. Hipervínculo a información estadística general de las personas beneficiadas por el programa",1]
[]
[null,null,"Criterios Adjetivos LTG 2018 - LTG 2020 (DOF 28/12/20) "]
[]
[null,null,"Criterio",null,"Valoración","Tipo","Observaciones, Recomendaciones y/o Requerimientos"]
[null,null,"Criterio 73. Periodo de actualización de la información: trimestral (la información de los programas que se desarrollarán a lo largo del ejercicio deberá publicarse durante el primer mes del año)",{"$f":"IF(E159=\"Justificado\",0,1)","v":1}]
[null,null,"Criterio74. La información publicada deberá estar actualizada al periodo que corresponde de acuerdo con la Tabla de actualización y conservación de la información",1]
[null,null,"Criterio 75. Conservar en el sitio de Internet y a través de la Plataforma Nacional la información del ejercicio en curso y la correspondiente a los dos ejercicios anteriores",1]
[null,null,"Criterio 76. Área(s) responsable(s) que genera(n), posee(n), publica(n) y/o actualiza(n)la información",1]
[null,null,"Criterio 77. Fecha de actualización de la información publicada con el formato día/mes/año ",1]
[null,null,"Criterio 78. Fecha de validación de la información publicada con el formato día/mes/año  ",1]
[null,null,"Criterio 79. Nota. Este criterio se cumple en caso de que sea necesario que el sujeto obligado incluya alguna aclaración relativa a la información publicada y/o explicación por la falta de información ",1]
[null,null,"Criterio 80. La información publicada se organiza mediante los formatos 15a y 15b, en los que se incluyen todos los campos especificados en los criterios sustantivos de contenido",1]
[null,null,"Criterio 81. El soporte de la información permite su reutilización",1]
{"$rows_empty":7}
[{"$nulls":3},2017,2018]
[null,null,"CS",{"$f":"IF(Aplicabilidad!G26<>\"SI\",\"NA\",SUM(E19:E75)/SUM(D19:D75))","v":"NA"},{"$f":"IF(Aplicabilidad!G26<>\"SI\",\"NA\",SUM(E83:E154)/SUM(D83:D154))","v":"NA"}]
[null,null,"CA",{"$f":"IF(Aplicabilidad!G26<>\"SI\",\"NA\",SUM(#REF!)/SUM(#REF!))","v":"NA"},{"$f":"IF(Aplicabilidad!G26<>\"SI\",\"NA\",SUM(E159:E167)/SUM(D159:D167))","v":"NA"}]
[null,null,"OBLIGACIÓN",{"$f":"IF(Aplicabilidad!G26<>\"SI\",\"NA\",D176*0.6+D177*0.4)","v":"NA"},{"$f":"IF(Aplicabilidad!G26<>\"SI\",\"NA\",E176*0.6+E177*0.4)","v":"NA"}]

{"sheet":"Art 74_XVI","index":18,"n_rows":92,"n_cols":7,"rows_kept":92,"hidden":true,"merged":[[0,2,0,6],[4,1,4,7],[14,4,14,6],[45,4,45,6]]}
[null,null,{"$f":"IF(Aplicabilidad!E2=\"\",\"\",Aplicabilidad!E2)","v":"Consejería Jurídica"}]
[]
[null,"Códigos de valoración : Cumplió totalmente = 1; Cumplió parcialmente = 0.5; No cumplió = 0; Justificado = Justificado"]
[]
[null,"Art. 74 - Fracción XVI. Relaciones laborales y recursos públicos a  sindicatos"]
[]
[null,null,"Fecha de Inicio de la Verificación:",{"$nulls":3},"Fecha de Término de la verificación"]
[null,null,{"$f":"IF(Resultados!$C$7=\"\",\"\",Resultados!$C$7)","v":"2021-07-07"},"2018-05-25",null,null,{"$f":"IF(Resultados!G7=\"\",\"\",Resultados!G7)","v":"2021-07-08"}]
[]
[null,null,"Criterios Sustantivos",null,{"$f":"IF(Aplicabilidad!G27<>\"SI\",\"NA\",(SUM(E19:E42)+SUM(E50:E68))/(SUM(D19:D42)+SUM(D50:D68)))","v":"NA"}]
[null,null,"Criterios Adjetivos",null,{"$f":"IF(Aplicabilidad!G27<>\"SI\",\"NA\",(SUM(E73:E81))/(SUM(D73:D81)))","v":"NA"}]
[null,null,"Obligación",null,{"$f":"IF(Aplicabilidad!G27<>\"SI\",\"NA\",E10*0.6+E11*0.4)","v":"NA"}]
[]
[]
[]
[null,null,"Criterios Sustantivos de contenido \nLTG 2018 - LTG 2020 (DOF 28/12/20) ",{"$f":"COUNTA(F19:F43)","v":0}]
[]
[null,null,"Criterio",null,"Valoración","Tipo","Observaciones, Recomendaciones y/o Requerimientos"]
[null,null,"Criterio 1. Tipo de personal: Base / Confianza",{"$f":"IF(E19=\"Justificado\",0,1)","v":1}]
[null,null,"Criterio 2. Tipo de normatividad. Incluir catálogo: Constitución Política de los Estados Unidos Mexicanos / Tratados internacionales / Constitución Política de la entidad federativa o Estatuto de gobierno del Distrito Federal / Leyes generales, federales y locales / Códigos / Reglamentos / Decreto de creación / Manuales administrativos, de integración, organizacionales / Reglas de operación / Criterios / Políticas / Otros documentos normativos: normas, bandos, resoluciones, lineamientos circulares, acuerdos, convenios, contratos, estatutos sindicales, estatutos universitarios, estatutos de personas morales, memorandos de entendimiento, entre otros aplicables al sujeto obligado de conformidad con sus facultades y atribuciones",{"$f":"IF(E20=\"Justificado\",0,1)","v":1}]
[null,null,"Criterio 3. Denominación del documento, en su caso, Condiciones Generales de Trabajo",1]
[null,null,"Criterio 4. Fecha de aprobación, registro ante la autoridad correspondiente o la publicación oficial de las Condiciones Generales de Trabajo, por ejemplo Diario Oficial de la Federación, gaceta o periódico correspondiente; con el formato día/mes/año (por ej. 31/Marzo/2016)",1]
[null,null,"Criterio 5. Fecha, en su caso, de la última modificación de la norma o de las Condiciones Generales de Trabajo con el formato día/mes/año (por ej. 31/Marzo/2016)",1]
[null,null,"Criterio 6. Hipervínculo al documento Condiciones Generales de Trabajo completo o a la normatividad correspondiente",1]
[null,null,"Criterio 7. Denominación del contrato convenio, o documento que regule las relaciones laborales",1]
[null,null,"Criterio 8. Fecha de aprobación, registro ante la autoridad correspondiente o en su caso, publicación en el DOF, gaceta u órgano de difusión oficial, en su caso con el formato día/mes/año (por ej. 31/Marzo/2016)",1]
[null,null,"Criterio 9. Fecha de última modificación, en su caso, y con el formato día/mes/año (por ej. 31/Marzo/2016)",1]
[null,null,"Criterio 10. Hipervínculo al documento completo",1]
[null,null,"Criterio 11. Ejercicio",1]
[null,null,"Criterio 12. Periodo que se informa",1]
[null,null,"Criterio 13. Fecha de entrega de los recursos públicos, con el formato día/mes/año (por ejemplo 31/Marzo/2016)",1]
[null,null,"Criterio 14. Tipo de recursos públicos: efectivo / en especie (materiales) / donativos",1]
[null,null,"Criterio 15. Descripción breve de los recursos",1]
[null,null,"Criterio 16. Denominación del(os) sindicato(s) al(os) cual(es) se les entregó el recurso público",1]
[null,null,"Criterio 17. Hipervínculo al acta constitutiva del sindicato",1]
[null,null,"Criterio 18. Hipervínculo al oficio, petición, carta o documento en el que conste la petición del donativo",1]
[null,null,"Criterio 19. Monto de los recursos públicos entregados en efectivo, en especie o donativos",1]
[null,null,"Criterio 20. Objetivos por los cuales se entrega el donativo",1]
[null,null,"Criterio 21. Descripción de los recursos en especie, en su caso",1]
[null,null,"Criterio 22. Hipervínculo, en su caso, al informe de uso de recursos que entregue el sindicato al sujeto obligado",1]
[null,null,"Criterio 23. Hipervínculo, en su caso, al(los) Programa(s) con objetivos y metas por los que se entregan los recursos para cubrir las prestaciones establecidas en las Condiciones Generales de Trabajo de los Contratos Colectivos de Trabajo",{"$f":"IF(E41=\"Justificado\",0,1)","v":1}]
[null,null,"Criterio 24. Hipervínculo, en su caso, a los Programas con objetivos y metas por los que se entregan los donativos",{"$f":"IF(E42=\"Justificado\",0,1)","v":1}]
[]
[]
[]
[]
[null,null,"Criterios Sustantivos de contenido LTG 2018 - LTG 2020 (DOF 28/12/20) ",{"$f":"COUNTA(F50:F81)","v":1}]
[]
[null,null,"Criterio",null,"Valoración","Tipo","Observaciones, Recomendaciones y/o Requerimientos"]
[null,null,"Criterio 1. Ejercicio ",{"$f":"IF(E50=\"Justificado\",0,1)","v":1}]
[null,null,"Criterio 2. Periodo que se informa (fecha de inicio y fecha de término con el formato día/mes/año) ",{"$f":"IF(E51=\"Justificado\",0,1)","v":1}]
[null,null,"Criterio 3. Tipo de personal (catálogo): Base / Confianza",1]
[null,null,"Criterio 4. Tipo de normatividad (catálogo): Constitución Política de los Estados Unidos Mexicanos/Tratado internacional/Constitución Política de la entidad federativa/Estatuto/Ley General/Ley Federal/Ley Orgánica/Ley local/Ley Reglamentaria/Código/Reglamento/Decreto/Manual/Reglas de operación/ Criterios/Política/Condiciones/Norma/Bando/Resolución/Lineamientos/Circular/Acuerdo/Convenio/Contrato/Estatuto sindical/Estatuto Universitario/Estatuto de personas morales/Memorando de entendimiento/Otro",1]
[null,null,"Criterio 5. Denominación de las condiciones generales de trabajo, contrato, convenio o documento que regule las relaciones laborales ",1]
[null,null,"Criterio 6. Fecha de aprobación, registro ante la autoridad correspondiente o la publicación oficial, por ejemplo: Diario Oficial de la Federación, gaceta o periódico correspondiente; con el formato día/mes/año ",1]
[null,null,"Criterio 7. Fecha, en su caso, de la última modificación de las Condiciones Generales de Trabajo, contrato, convenio o documento que regule las relaciones laborales con el formato día/mes/año",1]
[null,null,"Criterio 8. Hipervínculo al documento de condiciones Generales de Trabajo, contrato, convenio o documento que regule las relaciones laborales completo",1]
[null,null,"Criterio 9. Ejercicio",1]
[null,null,"Criterio 10. Periodo que se informa (fecha de inicio y fecha de término)",1]
[null,null,"Criterio 11. Tipo de recursos públicos (catálogo): efectivo / en especie (materiales) / donativos",1]
[null,null,"Criterio 12. Descripción y/o monto de los recursos públicos entregados en efectivo, especie o donativos",1]
[null,null,"Criterio 13. Motivos por los cuales se entrega el recurso en efectivo, especie o donativo ",1]
[null,null,"Criterio 14. Fecha de entrega de los recursos públicos, con el formato día/mes/año ",1]
[null,null,"Criterio 15. Denominación del(os) sindicato(s) al(os) cual(es) se les entregó el recurso público",1]
[null,null,"Criterio 16. Hipervínculo al oficio, petición, carta o documento en el que conste la petición del donativo, en su caso",1]
[null,null,"Criterio 17. Hipervínculo, en su caso, al informe de uso de recursos en efectivo, especie o donativos que entregue el sindicato al sujeto obligado",1]
[null,null,"Criterio 18. Hipervínculo, en su caso, al(los) Programa(s) con objetivos y metas por los que se entregan los recursos para cubrir las prestaciones establecidas en las Condiciones Generales de Trabajo de los Contratos Colectivos de Trabajo",{"$f":"IF(E67=\"Justificado\",0,1)","v":1}]
[null,null,"Criterio 19. Hipervínculo, en su caso, a los Programas con objetivos y metas por los que se entregan los donativos",{"$f":"IF(E68=\"Justificado\",0,1)","v":1}]
[]
[null,null,"Criterios Adjetivos LTG 2018 - LTG 2020 (DOF 28/12/20) "]
[]
[null,null,"Criterio",null,"Valoración","Tipo","Observaciones, Recomendaciones y/o Requerimientos"]
[null,null,"Criterio 20. Periodo de actualización de la información: trimestral; cuando se establezca, modifique o derogue cualquier norma laboral aplicable al sujeto obligado, la información normativa deberá actualizarse en un plazo no mayor a 15 días hábiles a partir de su publicación y/o aprobación",{"$f":"IF(E73=\"Justificado\",0,1)","v":1}]
[null,null,"Criterio 21. La información publicada deberá estar actualizada al periodo que corresponde de acuerdo con la Tabla de actualización y conservación de la información",1]
[null,null,"Criterio 22. Conservar en el sitio de Internet y a través de la Plataforma Nacional la información vigente de acuerdo con la Tabla de actualización y conservación de la información",1]
[null,null,"Criterio 23. Área(s) responsable(s) que genera(n), posee(n), publica(n) y/o actualiza(n)la información ",1]
[null,null,"Criterio 24. Fecha de actualización de la información publicada con el formato día/mes/año ",1]
[null,null,"Criterio 25. Fecha de validación de la información publicada con el formato día/mes/año ",1]
[null,null,"Criterio 26. Nota. Este criterio se cumple en caso de que sea necesario que el sujeto obligado incluya alguna aclaración relativa a la información publicada y/o explicación por la falta de información",1]
[null,null,"Criterio 27. La información publicada se organiza mediante los formatos 16a y 16b, en los que se incluyen todos los campos especificados en los criterios sustantivos de contenido",1]
[null,null,"Criterio 28. El soporte de la información permite su reutilización",1]
{"$rows_empty":7}
[{"$nulls":3},2017,2018]
[null,null,"CS",{"$f":"IF(Aplicabilidad!G27<>\"SI\",\"NA\",SUM(E19:E42)/SUM(D19:D42))","v":"NA"},{"$f":"IF(Aplicabilidad!G27<>\"SI\",\"NA\",SUM(E50:E68)/SUM(D50:D68))","v":"NA"}]
[null,null,"CA",{"$f":"IF(Aplicabilidad!G27<>\"SI\",\"NA\",SUM(#REF!)/SUM(#REF!))","v":"NA"},{"$f":"IF(Aplicabilidad!G27<>\"SI\",\"NA\",SUM(E73:E81)/SUM(D73:D81))","v":"NA"}]
[null,null,"OBLIGACIÓN",{"$f":"IF(Aplicabilidad!G27<>\"SI\",\"NA\",D90*0.6+D91*0.4)","v":"NA"},{"$f":"IF(Aplicabilidad!G27<>\"SI\",\"NA\",E90*0.6+E91*0.4)","v":"NA"}]

{"sheet":"Art 74_XVII","index":19,"n_rows":58,"n_cols":7,"rows_kept":58,"merged":[[0,2,0,6],[4,1,4,7],[15,4,15,6]]}
[null,null,{"$f":"IF(Aplicabilidad!E2=\"\",\"\",Aplicabilidad!E2)","v":"Consejería Jurídica"}]
[]
[null,"Códigos de valoración : Cumplió totalmente = 1; Cumplió parcialmente = 0.5; No cumplió = 0; Justificado = Justificado"]
[]
[null,"Art. 74 - Fracción XVII. Datos curriculares"]
[]
[null,null,"Fecha de Inicio de la Verificación:",{"$nulls":3},"Fecha de Término de la verificación"]
[null,null,{"$f":"IF(Resultados!$C$7=\"\",\"\",Resultados!$C$7)","v":"2021-07-07"},"2018-05-25",null,null,{"$f":"IF(Resultados!G7=\"\",\"\",Resultados!G7)","v":"2021-07-08"}]
[]
[null,null,"Criterios Sustantivos",null,{"$f":"IF(Aplicabilidad!G28<>\"SI\",\"NA\",(SUM(E20:E34))/(SUM(D20:D34)))","v":{"v":1,"d":"100%"}}]
[null,null,"Criterios Adjetivos",null,{"$f":"IF(Aplicabilidad!G28<>\"SI\",\"NA\",(SUM(E39:E47))/(SUM(D39:D47)))","v":{"v":1,"d":"100%"}}]
[null,null,"Obligación",null,{"$f":"IF(Aplicabilidad!G28<>\"SI\",\"NA\",E10*0.6+E11*0.4)","v":{"v":1,"d":"100.00%"}}]
[]
[]
[]
[null,null,"Criterios Sustantivos de contenido \nLTG 2018 - LTG 2020 (DOF 28/12/20) "]
[null,null,"Criterios Sustantivos de contenido LTG 2018 - LTG 2020 (DOF 28/12/20) ",{"$f":"COUNTA(F20:F47)","v":1}]
[]
[null,null,"Criterio",null,"Valoración","Tipo","Observaciones, Recomendaciones y/o Requerimientos"]
[null,null,"Criterio 1. Ejercicio",{"$f":"IF(E20=\"Justificado\",0,1)","v":1},1]
[null,null,"Criterio 2. Periodo que se informa (fecha de inicio y fecha de término con el formato día/mes/año)",{"$f":"IF(E21=\"Justificado\",0,1)","v":1},1]
[null,null,"Criterio 3. Denominación del puesto (de acuerdo con el catálogo que en su caso regule la actividad del sujeto obligado)",1,1]
[null,null,"Criterio 4. Denominación del cargo (de conformidad con nombramiento otorgado)",1,1]
[null,null,"Criterio 5. Nombre del servidor(a) público(a), integrante y/o, miembro del sujeto obligado, y/o persona que desempeñe un empleo, cargo o comisión y/o ejerza actos de autoridad (nombre[s], primer apellido, segundo apellido)",1,1]
[null,null,"Criterio 6. Área de adscripción (de acuerdo con el catálogo que en su caso regule la actividad del sujeto obligado) ",1,1]
[null,null,"Criterio 7. Escolaridad, nivel máximo de estudios concluido y comprobable (catálogo): Ninguno/Primaria/Secundaria/Bachillerato/Carrera técnica/Licenciatura/Maestría/Doctorado/Posdoctorado/Especialización",1,1]
[null,null,"Criterio 8. Carrera genérica, en su caso",1,1]
[null,null,"Criterio 9. Periodo (mes/año de inicio y mes/año de conclusión)",1,1]
[null,null,"Criterio 10. Denominación de la institución o empresa",1,1]
[null,null,"Criterio 11. Cargo o puesto desempeñado",1,1]
[null,null,"Criterio 12. Campo de experiencia",1,1]
[null,null,"Criterio 13. Hipervínculo al documento que contenga la información relativa a la trayectoria del (la) servidor(a) público(a), que deberá contener, además de los datos mencionados en los criterios anteriores, información adicional respecto a la trayectoria académica, profesional o laboral que acredite su capacidad y habilidades o pericia para ocupar el cargo público",1,1]
[null,null,"Criterio 14. Cuenta con sanciones administrativas definitivas aplicadas por la autoridad competente (catálogo): Sí/No",1,1]
[null,null,"Criterio 15. Hipervínculo a la resolución donde se observe la aprobación de la sanción (Criterio adicionado DOF 28/12/2020)",0,"Justificado"]
[]
[null,null,"Criterios Adjetivos LTG 2018 - LTG 2020 (DOF 28/12/20) "]
[]
[null,null,"Criterio",null,"Valoración","Tipo","Observaciones, Recomendaciones y/o Requerimientos"]
[null,null,"Criterio 16. Periodo de actualización de la información: trimestral. En su caso, 15 días hábiles después de alguna modificación",{"$f":"IF(E39=\"Justificado\",0,1)","v":1},1]
[null,null,"Criterio 17. La información publicada deberá estar actualizada al periodo que corresponde de acuerdo con la Tabla de actualización y conservación de la información",1,1]
[null,null,"Criterio 18. Conservar en el sitio de Internet y a través de la Plataforma Nacional la información vigente ",1,1]
[null,null,"Criterio 19. Área(s) responsable(s) que genera(n), posee(n), publica(n) y/o actualiza(n)la información ",1,1]
[null,null,"Criterio 20. Fecha de actualización de la información publicada con el formato día/mes/año ",1,1]
[null,null,"Criterio 21. Fecha de validación de la información publicada con el formato día/mes/año ",1,1]
[null,null,"Criterio 22. Nota. Este criterio se cumple en caso de que sea necesario que el sujeto obligado incluya alguna aclaración relativa a la información publicada y/o explicación por la falta de información ",1,1]
[null,null,"Criterio 23. La información publicada se organiza mediante el formato 17, en el que se incluyen todos los campos especificados en los criterios sustantivos de contenido",1,1]
[null,null,"Criterio 24. El soporte de la información permite su reutilización",1,1]
{"$rows_empty":7}
[{"$nulls":3},2017,2018]
[null,null,"CS",{"$f":"IF(Aplicabilidad!G28<>\"SI\",\"NA\",SUM(#REF!)/SUM(#REF!))","v":{"$error":"#REF!"}},{"$f":"IF(Aplicabilidad!G28<>\"SI\",\"NA\",SUM(E20:E34)/SUM(D20:D34))","v":{"v":1,"d":"100.00%"}}]
[null,null,"CA",{"$f":"IF(Aplicabilidad!G28<>\"SI\",\"NA\",SUM(#REF!)/SUM(#REF!))","v":{"$error":"#REF!"}},{"$f":"IF(Aplicabilidad!G28<>\"SI\",\"NA\",SUM(E39:E47)/SUM(D39:D47))","v":{"v":1,"d":"100.00%"}}]
[null,null,"OBLIGACIÓN",{"$f":"IF(Aplicabilidad!G28<>\"SI\",\"NA\",D56*0.6+D57*0.4)","v":{"$error":"#REF!"}},{"$f":"IF(Aplicabilidad!G28<>\"SI\",\"NA\",E56*0.6+E57*0.4)","v":{"v":1,"d":"100.00%"}}]

{"sheet":"Art 74_XVIII","index":20,"n_rows":87,"n_cols":7,"rows_kept":87,"merged":[[0,2,0,6],[4,1,4,7],[14,4,14,6],[35,4,35,6]]}
[null,null,{"$f":"IF(Aplicabilidad!E2=\"\",\"\",Aplicabilidad!E2)","v":"Consejería Jurídica"}]
[]
[null,"Códigos de valoración : Cumplió totalmente = 1; Cumplió parcialmente = 0.5; No cumplió = 0; Justificado = Justificado"]
[]
[null,"Art. 74 - Fracción XVIII. Funcionarios sancionados"]
[]
[null,null,"Fecha de Inicio de la Verificación:",{"$nulls":3},"Fecha de Término de la verificación"]
[null,null,{"$f":"IF(Resultados!$C$7=\"\",\"\",Resultados!$C$7)","v":"2021-07-07"},"2018-05-25",null,null,{"$f":"IF(Resultados!G7=\"\",\"\",Resultados!G7)","v":"2021-07-08"}]
[]
[null,null,"Criterios Sustantivos",null,{"$f":"IF(Aplicabilidad!G29<>\"SI\",\"NA\",(SUM(E19:E32)+SUM(E40:E63))/(SUM(D19:D32)+SUM(D40:D63)))","v":{"v":1,"d":"100%"}}]
[null,null,"Criterios Adjetivos",null,{"$f":"IF(Aplicabilidad!G29<>\"SI\",\"NA\",(SUM(E68:E76))/(SUM(D68:D76)))","v":{"v":1,"d":"100%"}}]
[null,null,"Obligación",null,{"$f":"IF(Aplicabilidad!G29<>\"SI\",\"NA\",E10*0.6+E11*0.4)","v":{"v":1,"d":"100.00%"}}]
[]
[]
[]
[null,null,"Criterios Sustantivos de contenido \nLTG 2018 - LTG 2020 (DOF 28/12/20) ",{"$f":"COUNTA(F19:F33)","v":0}]
[]
[null,null,"Criterio",null,"Valoración","Tipo","Observaciones, Recomendaciones y/o Requerimientos"]
[null,null,"Criterio 1. Nombre del (la) servidor(a) público(a) (y/o persona que desempeñe un empleo, cargo o comisión y/o ejerzan actos de autoridad en el sujeto obligado) (nombre[s], primer apellido, segundo apellido)",{"$f":"IF(E19=\"Justificado\",0,1)","v":0},"Justificado"]
[null,null,"Criterio 2. Clave o nivel del puesto (de acuerdo con el catálogo que en su caso regule la actividad del sujeto obligado)",{"$f":"IF(E20=\"Justificado\",0,1)","v":0},"Justificado"]
[null,null,"Criterio 3. Denominación del puesto (de acuerdo con el catálogo que en su caso regule la actividad del sujeto obligado, por ej. Subdirector[a])",0,"Justificado"]
[null,null,"Criterio 4. Denominación del cargo (de conformidad con el nombramiento otorgado, por ej. Subdirector[a] de recursos humanos)",0,"Justificado"]
[null,null,"Criterio 5. Unidad administrativa de adscripción (Área) del servidor público (de acuerdo con el catálogo de unidades administrativas o puestos, si así corresponde)",0,"Justificado"]
[null,null,"Criterio 6. Tipo de sanción (Catálogo): Amonestación pública / Amonestación privada / Apercibimiento público / Apercibimiento privado / Sanción económica (especificar monto) / Suspensión del empleo / Cargo o comisión (especificar periodo en número de días) / Destitución del puesto / Inhabilitación temporal",0,"Justificado"]
[null,null,"Criterio 7. Orden jurisdiccional de la sanción (federal o estatal)",0,"Justificado"]
[null,null,"Criterio 8. Autoridad sancionadora",0,"Justificado"]
[null,null,"Criterio 9. Número de expediente",0,"Justificado"]
[null,null,"Criterio 10. Fecha de la resolución en la que se aprobó la sanción, con el formato día/mes/año (por ej. 31/Marzo/2016)",0,"Justificado"]
[null,null,"Criterio 11. Causa de la sanción (descripción breve de las causas que dieron origen a la irregularidad)",0,"Justificado"]
[null,null,"Criterio 12. Denominación de la normatividad infringida",0,"Justificado"]
[null,null,"Criterio 13. Hipervínculo a la resolución donde se observe la aprobación de la sanción",{"$f":"IF(E31=\"Justificado\",0,1)","v":0},"Justificado"]
[null,null,"Criterio 14. Hipervínculo al sistema de registro de sanciones correspondiente",{"$f":"IF(E32=\"Justificado\",0,1)","v":0},"Justificado"]
[]
[]
[]
[]
[null,null,"Criterios Sustantivos de contenido \nLTG 2018 - LTG 2020 (DOF 28/12/20) ",{"$f":"COUNTA(F40:F76)","v":1}]
[]
[null,null,"Criterio",null,"Valoración","Tipo","Observaciones, Recomendaciones y/o Requerimientos"]
[null,null,"Criterio 1. Ejercicio",{"$f":"IF(E40=\"Justificado\",0,1)","v":1},1]
[null,null,"Criterio 2. Periodo que se informa (fecha de inicio y fecha de término con el formato día/mes/año)",{"$f":"IF(E41=\"Justificado\",0,1)","v":1},1]
[null,null,"Criterio 3. Nombre del (la) servidor(a) público(a) y/o persona que desempeñe un empleo, cargo o comisión y/o ejerzan actos de autoridad en el sujeto obligado (nombre[s], primer apellido, segundo apellido)",0,"Justificado"]
[null,null,"Criterio 4. Clave o nivel del puesto (de acuerdo con el catálogo que en su caso regule la actividad del sujeto obligado)",0,"Justificado"]
[null,null,"Criterio 5. Denominación del puesto (de acuerdo con el catálogo que en su caso regule la actividad del sujeto obligado)",0,"Justificado"]
[null,null,"Criterio 6. Denominación del cargo (de conformidad con el nombramiento otorgado)",0,"Justificado"]
[null,null,"Criterio 7. Denominación del área de adscripción del servidor público (de acuerdo con el catálogo que en su caso regule la actividad del sujeto obligado)",0,"Justificado"]
[null,null,"Criterio 8. Tipo de sanción. Por ejemplo: Suspensión del empleo, cargo o comisión; Destitución del empleo, cargo o comisión; Sanción económica; Inhabilitación temporal para desempeñar empleos, cargos o comisiones en el servicio público  y para participar en adquisiciones, arrendamientos, servicios u obras públicas  (Criterio adicionado DOF 28/12/2020)",0,"Justificado"]
[null,null,"Criterio 9. Tipo de sanción. Por ejemplo:  Suspensión del empleo, cargo o comisión; Destitución del empleo, cargo o comisión; Sanción económica; Inhabilitación temporal para desempeñar empleos, cargos o comisiones en el servicio público y para participar en adquisiciones, arrendamientos, servicios u obras públicas",0,"Justificado"]
[null,null,"Criterio 10. Orden jurisdiccional de la sanción (catálogo): Federal/Estatal",0,"Justificado"]
[null,null,"Criterio 11. Autoridad sancionadora",0,"Justificado"]
[null,null,"Criterio 12. Número de expediente",0,"Justificado"]
[null,null,"Criterio 13. Fecha de la resolución en la que se aprobó la sanción, con el formato día/mes/año",0,"Justificado"]
[null,null,"Criterio 14. Causa de la sanción (descripción breve de las causas que dieron origen a la irregularidad)",0,"Justificado"]
[null,null,"Criterio 15. Denominación de la normatividad infringida",0,"Justificado"]
[null,null,"Criterio 16. Artículo de la normatividad infringida  (Criterio adicionado DOF 28/12/2020)",0,"Justificado"]
[null,null,"Criterio 17. Fracción de la normatividad infringida  (Criterio adicionado DOF 28/12/2020)",0,"Justificado"]
[null,null,"Criterio 18. Fecha de inicio del procedimiento administrativo con el formato día/mes/año  (Criterio adicionado DOF 28/12/2020)",0,"Justificado"]
[null,null,"Criterio 19. de conclusión del procedimiento administrativo con el formato día/mes/año  (Criterio adicionado DOF 28/12/2020)",0,"Justificado"]
[null,null,"Criterio 20. Hipervínculo a la resolución donde se observe la aprobación de la sanción",0,"Justificado"]
[null,null,"Criterio 21. Hipervínculo al sistema de registro de sanciones correspondiente ",0,"Justificado"]
[null,null,"Criterio 22 . Monto de la indemnización establecida  (Criterio adicionado DOF 28/12/2020)",0,"Justificado"]
[null,null,"Criterio 23 . Monto de la indemnización efectivamente cobrada (Criterio adicionado DOF 28/12/2020)",0,"Justificado"]
[null,null,"Criterio 24. Fecha de cobro de la indemnización con el formato día/mes/año (Criterio adicionado DOF 28/12/2020)",0,"Justificado"]
[]
[null,null,"Criterios Adjetivos LTG 2018 - LTG 2020 (DOF 28/12/20) "]
[]
[null,null,"Criterio",null,"Valoración","Tipo","Observaciones, Recomendaciones y/o Requerimientos"]
[null,null,"Criterio 25. Periodo de actualización de la información: trimestral",{"$f":"IF(E68=\"Justificado\",0,1)","v":1},1]
[null,null,"Criterio 26. La información publicada deberá estar actualizada al periodo que corresponde de acuerdo con la Tabla de actualización y conservación de la información",1,1]
[null,null,"Criterio 27. Conservar en el sitio de Internet: información del ejercicio en curso. Respecto de los(as) servidores(as) públicos(as) que hayan sido sancionados y permanezcan en el sujeto obligado al momento de la actualización\nde información, se conservará la información correspondiente a dos ejercicios anteriores.",1,1]
[null,null,"Criterio 28. Área(s) responsable(s) que genera(n), posee(n), publica(n) y/o actualiza(n)la información ",1,1]
[null,null,"Criterio 29. Fecha de actualización de la información publicada con el formato día/mes/año ",1,1]
[null,null,"Criterio 30. Fecha de validación de la información publicada con el formato día/mes/año ",1,1]
[null,null,"Criterio 31. Nota. Este criterio se cumple en caso de que sea necesario que el sujeto obligado incluya alguna aclaración relativa a la información publicada y/o explicación por la falta de información",1,1]
[null,null,"Criterio 32. La información publicada se organiza mediante el formato 18, en el que se incluyen todos los campos especificados en los criterios sustantivos de contenido",1,1]
[null,null,"Criterio 33. El soporte de la información permite su reutilización",1,1]
{"$rows_empty":7}
[{"$nulls":3},2017,2018]
[null,null,"CS",{"$f":"IF(Aplicabilidad!G29<>\"SI\",\"NA\",SUM(E19:E32)/SUM(D19:D32))","v":{"$error":"#DIV/0!"}},{"$f":"IF(Aplicabilidad!G29<>\"SI\",\"NA\",SUM(E40:E63)/SUM(D40:D63))","v":{"v":1,"d":"100.00%"}}]
[null,null,"CA",{"$f":"IF(Aplicabilidad!G29<>\"SI\",\"NA\",SUM(#REF!)/SUM(#REF!))","v":{"$error":"#REF!"}},{"$f":"IF(Aplicabilidad!G29<>\"SI\",\"NA\",SUM(E68:E76)/SUM(D68:D76))","v":{"v":1,"d":"100.00%"}}]
[null,null,"OBLIGACIÓN",{"$f":"IF(Aplicabilidad!G29<>\"SI\",\"NA\",D85*0.6+D86*0.4)","v":{"$error":"#DIV/0!"}},{"$f":"IF(Aplicabilidad!G29<>\"SI\",\"NA\",E85*0.6+E86*0.4)","v":{"v":1,"d":"100.00%"}}]

{"sheet":"Art 74_XIX","index":21,"n_rows":78,"n_cols":7,"rows_kept":78,"merged":[[0,2,0,6],[4,1,4,7],[14,4,14,6]]}
[null,null,{"$f":"IF(Aplicabilidad!E2=\"\",\"\",Aplicabilidad!E2)","v":"Consejería Jurídica"}]
[]
[null,"Códigos de valoración : Cumplió totalmente = 1; Cumplió parcialmente = 0.5; No cumplió = 0; Justificado = Justificado"]
[]
[null,"Art. 74 - Fracción XIX. Servicios"]
[]
[null,null,"Fecha de Inicio de la Verificación:",{"$nulls":3},"Fecha de Término de la verificación"]
[null,null,{"$f":"IF(Resultados!$C$7=\"\",\"\",Resultados!$C$7)","v":"2021-07-07"},"2018-05-25",null,null,{"$f":"IF(Resultados!G7=\"\",\"\",Resultados!G7)","v":"2021-07-08"}]
[]
[null,null,"Criterios Sustantivos",null,{"$f":"IF(Aplicabilidad!G30<>\"SI\",\"NA\",(+SUM(E19:E54))/(+SUM(D19:D54)))","v":{"v":0.8,"d":"80%"}}]
[null,null,"Criterios Adjetivos",null,{"$f":"IF(Aplicabilidad!G30<>\"SI\",\"NA\",(+SUM(E59:E67))/(+SUM(D59:D67)))","v":{"v":1,"d":"100%"}}]
[null,null,"Obligación",null,{"$f":"IF(Aplicabilidad!G30<>\"SI\",\"NA\",E10*0.6+E11*0.4)","v":{"v":0.88,"d":"88.00%"}}]
[]
[]
[]
[null,null,"Criterios Sustantivos de contenido \nLTG 2018 - LTG 2020 (DOF 28/12/20) ",{"$f":"COUNTA(F19:F67)","v":8}]
[]
[null,null,"Criterio",null,"Valoración","Tipo","Observaciones, Recomendaciones y/o Requerimientos"]
[null,null,"Criterio 1. Ejercicio",{"$f":"IF(E19=\"Justificado\",0,1)","v":1},1]
[null,null,"Criterio 2. Periodo que se informa (fecha de inicio y fecha de término con el formato día/mes/año)",{"$f":"IF(E20=\"Justificado\",0,1)","v":1},1]
[null,null,"Criterio 3. Nombre del servicio (Criterio modificado DOF 28/12/2020)",1,1]
[null,null,"Criterio 4. Tipo de servicio (catálogo): Directo/Indirecto",1,1]
[null,null,"Criterio 5. Tipo de usuario y/o población objetivo. Especificar los casos en que se puede obtener el servicio",1,1]
[null,null,"Criterio 6. Descripción del servicio. Utilizar un lenguaje claro, sencillo y conciso, así como los casos en que debe o puede realizarse el servicio, y los pasos que debe llevar a cabo el particular para su realización. (Criterio modificado DOF 28/12/2020)",1,1]
[null,null,"Criterio 7. Modalidad del servicio. Por ejemplo: presencial, en línea, correo, mensajería, telefónica, módulo itinerante, etcétera",1,1]
[null,null,"Criterio 8. Enumerar y detallar los requisitos. En caso de que existan requisitos que necesiten alguna firma, validación, certificación, autorización o visto bueno de un tercero se deberá señalar la persona o empresa que lo emita. En caso deque el servicio que se esté inscribiendo incluya como requisitos la realización de trámites o servicios adicionales, deberá de identificar plenamente los mismos, señalando además el Sujeto Obligado ante quien se realiza (Criterio modificado DOF 28/12/2020)",1,1]
[null,null,"Criterio 9. Documentos requeridos, en su caso; así como especificar si el servicio debe  presentarse mediante formato, escrito libre, ambos o puede solicitarse por otros medios  (Criterio modificado DOF 28/12/2020)",1,1]
[null,null,"Criterio 10. Hipervínculo al/los formato(s) respectivo(s) publicado(s) en medio de difusión Oficial  (Criterio modificado DOF 28/12/2020)",0,"Justificado"]
[null,null,"Criterio 11. Última fecha de publicación del formato en el medio de difusión oficial (Criterio modificado DOF 28/12/2020)",1,1]
[null,null,"Criterio 12. Tiempo de respuesta. Especificar el plazo que tiene el Sujeto Obligado para resolver el servicio y, en su caso, indicar si aplica la afirmativa o la negativa ficta (Criterio modificado DOF 28/12/2020)",1,1]
[null,null,"Criterio 13. Plazo con el que cuenta el Sujeto Obligado para prevenir al solicitante  (Criterio adicionado DOF 28/12/2020)",1,1]
[null,null,"Criterio 14. Plazo con el que cuenta el solicitante para cumplir con la prevención  (Criterio adicionado DOF 28/12/2020)",1,1]
[null,null,"Criterio 15. Vigencia de los avisos, permisos, licencias, autorizaciones, registros y demás resoluciones que se emitan (Criterio adicionado DOF 28/12/2020)",1,1]
[null,null,"Criterio 16. Denominación del o las áreas y/o unidades administrativas del sujeto obligado en las que se proporciona el servicio, o en caso de ser un servicio indirecto, la denominación del permisionario, concesionario o empresa productiva del Estado (Criterio modificado DOF 28/12/2020)",1,0,"Requerimiento","Deberá publicar la información."]
[null,null,"Criterio 17. Domicilio de las áreas y/o unidades administrativas del sujeto obligado en las que se proporciona el servicio (tipo de vialidad [catálogo], nombre de vialidad [calle], número exterior, número interior [en su caso], tipo de asentamiento humano [catálogo], nombre de asentamiento humano [colonia], clave de la localidad, nombre de la localidad, clave del municipio, nombre del municipio o delegación, clave de la entidad federativa, nombre de la entidad federativa [catálogo], código postal)  (Criterio modificado DOF 28/12/2020)",1,0,"Requerimiento","Deberá publicar la información."]
[null,null,"Criterio 18. Domicilio en el extranjero. En caso de que el servicio se lleve a cabo en otro país, se deberá incluir el domicilio el cual deberá incluir por lo menos: país, ciudad, calle y número",1,0,"Requerimiento","Deberá publicar la información."]
[null,null,"Criterio 19. Teléfono, extensión en su caso, de contacto de la oficina de atención ",1,0,"Requerimiento","Deberá publicar la información."]
[null,null,"Criterio 20. Medios electrónicos de comunicación de la oficina de atención y/o del responsable del Servicio   (Criterio modificado DOF 28/12/2020)",1,0,"Requerimiento","Deberá publicar la información."]
[null,null,"Criterio 21 Horario de atención (días y horas)",1,0,"Requerimiento","Deberá publicar la información."]
[null,null,"Criterio 22 Objetivo de la inspección o verificación, en caso de que se requiera para llevar a cabo el servicio (Criterio adicionado DOF 28/12/2020)",1,0,"Requerimiento","Deberá publicar la información."]
[null,null,"Criterio 23. Monto de los derechos o aprovechamientos aplicables, en su caso, o la forma de determinar dicho monto, así como las alternativas para realizar el pago. En su caso, especificar que es gratuit (Criterio modificado DOF 28/12/2020)",1,1]
[null,null,"Criterio 24. Sustento legal para su cobro, en su caso",1,1]
[null,null,"Criterio 25. Lugares donde se efectúa el pago",1,1]
[null,null,"Criterio 26. Fundamento jurídico-administrativo del servicio",1,1]
[null,null,"Criterio 27. Derechos del usuario ante la negativa y/o falta en la prestación del servicio",1,1]
[null,null,"Criterio 28 Información que deberá conservar para fines de acreditación, inspección y verificación con motivo del servicio (Criterio adicionado DOF 28/12/2020)",1,1]
[null,null,"Criterio 29 Información adicional del servicio, en su caso\n(Criterio adicionado DOF 28/12/2020)",1,1]
[null,null,"Criterio 30 Teléfono(s) y, en su caso, extensión(es)\n(Criterio adicionado DOF 28/12/2020)",1,1]
[null,null,"Criterio 31 Medios electrónicos de comunicación\n(Criterio adicionado DOF 28/12/2020)",1,1]
[null,null,"Criterio 32 Domicilio (tipo de vialidad [catálogo], nombre de vialidad [calle], número exterior, número interior [en su caso], tipo de asentamiento humano\n[catálogo], nombre de asentamiento humano [colonia], clave de la localidad, nombre de la localidad, clave del municipio, nombre del municipio o delegación, clave de la entidad federativa, nombre de la entidad federativa [catálogo], código postal) (Criterio adicionado DOF 28/12/2020)",1,1]
[null,null,"Criterio 33. Teléfono(s) y, en su caso, extensión(es)\n(Criterio modificado DOF 28/12/2020)",1,1]
[null,null,"Criterio 34 Medios electrónicos de comunicación\n(Criterio adicionado DOF 28/12/2020)",1,1]
[null,null,"Criterio 35. Domicilio (tipo de vialidad [catálogo], nombre de vialidad [calle], número exterior, número interior [en su caso], tipo de asentamiento humano [catálogo], nombre de asentamiento humano [colonia], clave de la localidad, nombre de la localidad, clave del municipio, nombre del municipio o delegación, clave de la entidad federativa, nombre de la entidad federativa [catálogo], código postal)",1,1]
[null,null,"Criterio 36 Hipervínculo al Catálogo Nacional de Regulaciones, Tramites y Servicios o al sistema homólogo en la materia\n(Criterio modificado DOF 28/12/2020)",1,1]
[]
[null,null,"Criterios Adjetivos LTG 2018 - LTG 2020 (DOF 28/12/20) "]
[]
[null,null,"Criterio",null,"Valoración","Tipo","Observaciones, Recomendaciones y/o Requerimientos"]
[null,null,"Criterio 37. Periodo de actualización de la información: trimestral",{"$f":"IF(E59=\"Justificado\",0,1)","v":1},1]
[null,null,"Criterio 38. La información publicada deberá estar actualizada al periodo que corresponde de acuerdo con la Tabla de actualización y conservación de la información",1,1]
[null,null,"Criterio 39. Conservar en el sitio de Internet y a través de la Plataforma Nacional la información vigente ",1,1]
[null,null,"Criterio 40. Área(s) responsable(s) que genera(n), posee(n), publica(n) y/o actualiza(n)la información ",1,1]
[null,null,"Criterio 41. Fecha de actualización de la información publicada con el formato día/mes/año ",1,1]
[null,null,"Criterio 42. Fecha de validación de la información publicada con el formato día/mes/año ",1,1]
[null,null,"Criterio 43. Nota. Este criterio se cumple en caso de que sea necesario que el sujeto obligado incluya alguna aclaración relativa a la información publicada y/o explicación por la falta de información",1,1]
[null,null,"Criterio 44. La información publicada se organiza mediante el formato 19, en el que se incluyen todos los campos especificados en los criterios sustantivos de contenido",1,1]
[null,null,"Criterio 45. El soporte de la información permite su reutilización",1,1]
{"$rows_empty":7}
[{"$nulls":3},2017,2018]
[null,null,"CS","NA",{"$f":"IF(Aplicabilidad!G30<>\"SI\",\"NA\",SUM(E19:E54)/SUM(D19:D54))","v":{"v":0.8,"d":"80.00%"}}]
[null,null,"CA","NA",{"$f":"IF(Aplicabilidad!G30<>\"SI\",\"NA\",SUM(E59:E67)/SUM(D59:D67))","v":{"v":1,"d":"100.00%"}}]
[null,null,"OBLIGACIÓN","NA",{"$f":"IF(Aplicabilidad!G30<>\"SI\",\"NA\",E76*0.6+E77*0.4)","v":{"v":0.88,"d":"88.00%"}}]

{"sheet":"Art 74_XX","index":22,"n_rows":79,"n_cols":7,"rows_kept":79,"merged":[[0,2,0,6],[4,1,4,7],[14,4,14,6]]}
[null,null,{"$f":"IF(Aplicabilidad!E2=\"\",\"\",Aplicabilidad!E2)","v":"Consejería Jurídica"}]
[]
[null,"Códigos de valoración : Cumplió totalmente = 1; Cumplió parcialmente = 0.5; No cumplió = 0; Justificado = Justificado"]
[]
[null,"Art. 74 - Fracción XX. Trámites"]
[]
[null,null,"Fecha de Inicio de la Verificación:",{"$nulls":3},"Fecha de Término de la verificación"]
[null,null,{"$f":"IF(Resultados!$C$7=\"\",\"\",Resultados!$C$7)","v":"2021-07-07"},"2018-05-25",null,null,{"$f":"IF(Resultados!G7=\"\",\"\",Resultados!G7)","v":"2021-07-08"}]
[]
[null,null,"Criterios Sustantivos",null,{"$f":"IF(Aplicabilidad!G31<>\"SI\",\"NA\",(+SUM(E19:E55))/(+SUM(D19:D55)))","v":{"v":0.5,"d":"50%"}}]
[null,null,"Criterios Adjetivos",null,{"$f":"IF(Aplicabilidad!G31<>\"SI\",\"NA\",(+SUM(E60:E68))/(+SUM(D60:D68)))","v":{"v":1,"d":"100%"}}]
[null,null,"Obligación",null,{"$f":"IF(Aplicabilidad!G31<>\"SI\",\"NA\",E10*0.6+E11*0.4)","v":{"v":0.7,"d":"70.00%"}}]
[]
[]
[]
[null,null,"Criterios Sustantivos de contenido \nLTG 2018 - LTG 2020 (DOF 28/12/20) ",{"$f":"COUNTA(F19:F68)","v":18}]
[]
[null,null,"Criterio",null,"Valoración","Tipo","Observaciones, Recomendaciones y/o Requerimientos"]
[null,null,"Criterio 1. Ejercicio",{"$f":"IF(E19=\"Justificado\",0,1)","v":1},1]
[null,null,"Criterio 2. Periodo que se informa (fecha de inicio y fecha de término con el formato día/mes/año)",{"$f":"IF(E20=\"Justificado\",0,1)","v":1},1]
[null,null,"Criterio 3. Nombre del trámite - Criterio modificado DOF 28/12/2020",1,1]
[null,null,"Criterio 4. Descripción del trámite. Utilizar un lenguaje claro, sencillo y conciso, así como los casos en que debe o puede realizarse el servicio, y los pasos que debe llevar a cabo el particular para su realización - Criterio modificado DOF 28/12/2020",1,1]
[null,null,"Criterio 5. Tipo de usuario y/o población objetivo Criterio modificado DOF 28/12/2020",1,1]
[null,null,"Criterio 6. Modalidad del trámite. Por ejemplo, presencial, en línea, correo, mensajería, Telefónica, módulo itinerante, etcétera",1,1]
[null,null,"Criterio 7. Hipervínculo a los requisitos para llevar a cabo el trámite. Enumerar y detallar los requisitos. En caso de que existan requisitos que necesiten alguna firma, validación, certificación, autorización o visto bueno de un tercero se deberá señalar la persona o empresa que lo emita. En caso de que el trámite incluya como requisitos la realización de trámites o servicios adicionales, deberá de identificar plenamente los mismos, señalando además el Sujeto Obligado ante quien se realiza - Criterio modificado DOF 28/12/2020",1,1]
[null,null,"Criterio 8. Documentos requeridos, en su caso; así como especificar si el trámite debe presentarse mediante formato, escrito libre, ambos o puede solicitarse por otros medios - Criterio modificado DOF 28/12/2020",1,1]
[null,null,"Criterio 9. Hipervínculo al/los formato(s) respectivo(s) publicado(s) en medio oficial",0,"Justificado"]
[null,null,"Criterio 10. Última fecha de publicación en el Medio de Difusión -\nCriterio adicionado DOF 28/12/2020",1,1]
[null,null,"Criterio 11. Tiempo de respuesta por parte del sujeto obligado55. Plazo que tiene el Sujeto Obligado para resolver el Servicio y, en su caso, si aplica la afirmativa o la negativa ficta - Criterio modificado DOF 28/12/2020",1,1]
[null,null,"Criterio 12. Plazo con el que cuenta el Sujeto Obligado para prevenir al solicitante - Criterio adicionado DOF 28/12/2020",1,1]
[null,null,"Criterio 13 Plazo con el que cuenta el solicitante para cumplir con la prevención - Criterio adicionado DOF 28/12/2020",1,1]
[null,null,"Criterio 14 Vigencia de los resultados del trámite",1,1]
[null,null,"Criterio 15.- Denominación del/las área/s o unidades administrativas en donde se realiza el trámite - Criterio modificado DOF 28/12/2020",1,0,"Requerimiento","Deberá publicar la información."]
[null,null,"Criterio 16 Domicilio de la oficina de atención (tipo de vialidad [catálogo], nombre de vialidad [calle], número exterior, número interior [en su caso], tipo de asentamiento humano [catálogo], nombre de asentamiento humano [colonia], clave de la localidad, nombre de la localidad, clave del municipio, nombre del municipio o delegación, clave de la entidad federativa, nombre de la entidad federativa [catálogo], código postal)",1,0,"Requerimiento","Deberá publicar la información."]
[null,null,"Criterio 17. Domicilio en el extranjero. En caso de que el trámite se lleve a cabo en otro país, se deberá incluir el domicilio el cual deberá incluir por lo menos: país, ciudad, calle y número",1,0,"Requerimiento","Deberá publicar la información."]
[null,null,"Criterio 18. Teléfono y extensión en su caso - Criterio modificado DOF 28/12/2020",1,0,"Requerimiento","Deberá publicar la información."]
[null,null,"Criterio 19. Medios electrónicos de comunicación - Criterio modificado DOF 28/12/2020",1,0,"Requerimiento","Deberá publicar la información."]
[null,null,"Criterio 20. Horario de atención (días y horas)",1,0,"Requerimiento","Deberá publicar la información."]
[null,null,"Criterio 21 Monto de los derechos o aprovechamientos aplicables, en su caso, o la forma de determinar dicho monto, así como las alternativas para realizar el pago - Criterio modificado DOF 28/12/2020",1,1]
[null,null,"Criterio 22. Sustento legal para su cobro, en su caso",1,1]
[null,null,"Criterio 23. Lugares donde se efectúa el pago",1,0,"Requerimiento","Deberá publicar la información."]
[null,null,"Criterio 24 Fundamento jurídico-administrativo de la existencia del Trámite -\nCriterio modificado DOF 28/12/2020",1,1]
[null,null,"Criterio 25. Derechos del usuario ante la negativa o falta de respuesta (especificar si aplica la afirmativa o negativa ficta)",1,1]
[null,null,"Criterio 23. Teléfono y extensión en su caso",1,0,"Requerimiento","Deberá publicar la información."]
[null,null,"Criterio 24. Correo electrónico",1,0,"Requerimiento","Deberá publicar la información."]
[null,null,"Criterio 25. Domicilio del lugar donde se reporten anomalías (tipo de vialidad [catálogo], nombre de vialidad [calle], número exterior, número interior [en su caso], tipo de asentamiento humano [catálogo], nombre de asentamiento humano [colonia], clave de la localidad, nombre de la localidad, clave del municipio, nombre del municipio o delegación, clave de la entidad federativa, nombre de la entidad federativa [catálogo], código postal)",1,0,"Requerimiento","Deberá publicar la información."]
[null,null,"Criterio 26. Información adicional del trámite, en su caso - Criterio adicionado DOF 28/12/2020",0,"Justificado"]
[null,null,"Criterio 27- Teléfono y, en su caso, extensión - Criterio adicionado DOF 28/12/2020",1,0,"Requerimiento","Deberá publicar la información."]
[null,null,"Criterio 28 Medios electrónicos de comunicación - Criterio adicionado DOF 28/12/2020",1,0,"Requerimiento","Deberá publicar la información."]
[null,null,"Criterio 29 Domicilio58a (tipo de vialidad [catálogo], nombre de vialidad [calle], número exterior, número interior [en su caso], tipo de asentamiento humano [catálogo], nombre de asentamiento humano [colonia], clave de la localidad, nombre de la localidad, clave del municipio, nombre del municipio o delegación, clave de la entidad federativa, nombre de la entidad federativa [catálogo], código postal) - Criterio adicionado DOF 28/12/2020",1,0,"Requerimiento","Deberá publicar la información."]
[null,null,"Criterio 30. Teléfono y extensión en su caso",1,0,"Requerimiento","Deberá publicar la información."]
[null,null,"Criterio 31. Medios electrónicos de comunicación - Criterio modificado DOF 28/12/2020",1,0,"Requerimiento","Deberá publicar la información."]
[null,null,"Criterio 32. Domicilio del lugar donde se reporten anomalías (tipo de vialidad [catálogo], nombre de vialidad [calle], número exterior, número interior [en su caso], tipo de asentamiento humano [catálogo], nombre de asentamiento humano [colonia], clave de la localidad, nombre de la localidad, clave del municipio, nombre del municipio o delegación, clave de la entidad federativa, nombre de la entidad federativa [catálogo], código postal)",1,0,"Requerimiento","Deberá publicar la información."]
[null,null,"Criterio 33. Domicilio en el extranjero. En caso de que el trámite se lleve a cabo en otro país, se deberá incluir el domicilio el cual deberá incluir por lo menos: país, ciudad, calle y número",1,0,"Requerimiento","Deberá publicar la información."]
[null,null,"Criterio 34 Hipervínculo al Catálogo Nacional de Regulaciones, Trámites y Servicios o al sistema homólogo en la materia - Criterio modificado DOF 28/12/2020",0,"Justificado"]
[]
[null,null,"Criterios Adjetivos LTG 2018 - LTG 2020 (DOF 28/12/20) "]
[]
[null,null,"Criterio",null,"Valoración","Tipo","Observaciones, Recomendaciones y/o Requerimientos"]
[null,null,"Criterio 35. Periodo de actualización de la información: trimestral",{"$f":"IF(E60=\"Justificado\",0,1)","v":1},1]
[null,null,"Criterio 36. La información publicada deberá estar actualizada al periodo que corresponde de acuerdo con la Tabla de actualización y conservación de la información",1,1]
[null,null,"Criterio 37. Conservar en el sitio de Internet y a través de la Plataforma Nacional la información vigente",1,1]
[null,null,"Criterio 38. Área(s) responsable(s) que genera(n), posee(n), publica(n) y/o actualiza(n)la información ",1,1]
[null,null,"Criterio 39. Fecha de actualización de la información publicada con el formato día/mes/año ",1,1]
[null,null,"Criterio 40. Fecha de validación de la información publicada con el formato día/mes/año ",1,1]
[null,null,"Criterio 41. Nota. Este criterio se cumple en caso de que sea necesario que el sujeto obligado incluya alguna aclaración relativa a la información publicada y/o explicación por la falta de información ",1,1]
[null,null,"Criterio 42. La información publicada se organiza mediante el formato 20, en el que se incluyen todos los campos especificados en los criterios sustantivos de contenido",1,1]
[null,null,"Criterio 43. El soporte de la información permite su reutilización",1,1]
{"$rows_empty":7}
[{"$nulls":3},2017,2018]
[null,null,"CS","NA",{"$f":"IF(Aplicabilidad!G31<>\"SI\",\"NA\",SUM(E19:E55)/SUM(D19:D55))","v":{"v":0.5,"d":"50.00%"}}]
[null,null,"CA","NA",{"$f":"IF(Aplicabilidad!G31<>\"SI\",\"NA\",SUM(E60:E68)/SUM(D60:D68))","v":{"v":1,"d":"100.00%"}}]
[null,null,"OBLIGACIÓN","NA",{"$f":"IF(Aplicabilidad!G31<>\"SI\",\"NA\",E77*0.6+E78*0.4)","v":{"v":0.7,"d":"70.00%"}}]

{"sheet":"Art 74_XXI","index":23,"n_rows":87,"n_cols":7,"rows_kept":87,"merged":[[0,2,0,6],[4,1,4,7],[14,4,14,6],[37,4,37,6]]}
[null,null,{"$f":"IF(Aplicabilidad!E2=\"\",\"\",Aplicabilidad!E2)","v":"Consejería Jurídica"}]
[]
[null,"Códigos de valoración : Cumplió totalmente = 1; Cumplió parcialmente = 0.5; No cumplió = 0; Justificado = Justificado"]
[]
[null,"Art. 74 - Fracción XXI. Presupuesto e informes trimestrales"]
[]
[null,null,"Fecha de Inicio de la Verificación:",{"$nulls":3},"Fecha de Término de la verificación"]
[null,null,{"$f":"IF(Resultados!$C$7=\"\",\"\",Resultados!$C$7)","v":"2021-07-07"},"2018-05-25",null,null,{"$f":"IF(Resultados!G7=\"\",\"\",Resultados!G7)","v":"2021-07-08"}]
[]
[null,null,"Criterios Sustantivos",null,{"$f":"IF(Aplicabilidad!G32<>\"SI\",\"NA\",(SUM(E19:E34)+SUM(E42:E63))/(SUM(D19:D34)+SUM(D42:D63)))","v":{"v":0.8888888888888888,"d":"89%"}}]
[null,null,"Criterios Adjetivos",null,{"$f":"IF(Aplicabilidad!G32<>\"SI\",\"NA\",(SUM(E68:E76))/(SUM(D68:D76)))","v":{"v":0.9444444444444444,"d":"94%"}}]
[null,null,"Obligación",null,{"$f":"IF(Aplicabilidad!G32<>\"SI\",\"NA\",E10*0.6+E11*0.4)","v":{"v":0.9111111111111111,"d":"91.11%"}}]
[]
[]
[]
[null,null,"Criterios Sustantivos de contenido \n2015 - 2017",{"$f":"COUNTA(F19:F35)","v":0}]
[]
[null,null,"Criterio",null,"Valoración","Tipo","Observaciones, Recomendaciones y/o Requerimientos"]
[null,null,"Criterio 1. Ejercicio",{"$f":"IF(E19=\"Justificado\",0,1)","v":1},1]
[null,null,"Criterio 2. Presupuesto anual asignado (gasto programable autorizado) al sujeto obligado",{"$f":"IF(E20=\"Justificado\",0,1)","v":1},1]
[null,null,"Criterio 3. Presupuesto por capítulo de gasto (con base en el Clasificador por Objeto de Gasto que le corresponda al sujeto obligado)",1,1]
[null,null,"Criterio 4. Hipervínculo al Presupuesto de Egresos de la Federación",1,1]
[null,null,"Criterio 5. Hipervínculo al Decreto de Presupuesto de Egresos de la entidad federativa (en su caso señalar que no aplica si se trata de un sujeto obligado de orden federal)",1,1]
[null,null,"Criterio 6. Fuentes de financiamiento para los recursos federales transferidos, vinculadas al reporte de egresos de la SHCP",1,1]
[null,null,"Criterio 7. Ejercicio",1,1]
[null,null,"Criterio 8. Periodo que se informa",1,1]
[null,null,"Criterio 9. Clave del capítulo de gasto",1,1]
[null,null,"Criterio 10. Objeto del capítulo de gasto",1,1]
[null,null,"Criterio 11. Denominación de cada capítulo de gasto",1,1]
[null,null,"Criterio 12. Presupuesto programado por capítulo de gasto",1,1]
[null,null,"Criterio 13. Presupuesto pendiente de pago",1,1]
[null,null,"Criterio 14. Presupuesto o monto reintegrado a la tesorería de la federación",1,1]
[null,null,"Criterio 15. Hipervínculo al informe trimestral sobre la ejecución del presupuesto realizado por el sujeto obligado y enviado a la SHCP, a la Secretaría de Finanzas u homólogo o la instancia según corresponda, de acuerdo con el orden de gobierno correspondiente",{"$f":"IF(E33=\"Justificado\",0,1)","v":1},1]
[null,null,"Criterio 16     . Hipervínculo a la Cuenta Pública consolidada por la instancia correspondiente según el orden de gobierno de que se trate, por ejemplo la SHCP, las secretarías de finanzas o sus equivalentes",{"$f":"IF(E34=\"Justificado\",0,1)","v":0},"Justificado"]
[]
[]
[]
[]
[null,null,"Criterios Sustantivos de contenido \nLTG 2018 - LTG 2020 (DOF 28/12/20) ",{"$f":"COUNTA(F42:F76)","v":10}]
[]
[null,null,"Criterio",null,"Valoración","Tipo","Observaciones, Recomendaciones y/o Requerimientos"]
[null,null,"Criterio 1. Ejercicio",{"$f":"IF(E42=\"Justificado\",0,1)","v":1},0.5,"Requerimiento","En el formato nuevo \"2018 y ejercicios posteriores\" deberá borrar los ejercicios anteriores a 2018 por que ya estan contenidos en el formato \"2015-2017\"."]
[null,null,"Criterio 2. Periodo que se informa (fecha de inicio y fecha de término con el formato día/mes/año)",{"$f":"IF(E43=\"Justificado\",0,1)","v":1},0.5,"Requerimiento","En el formato nuevo \"2018 y ejercicios posteriores\" deberá borrar los ejercicios anteriores a 2018 por que ya estan contenidos en el formato \"2015-2017\"."]
[null,null,"Criterio 3. Presupuesto anual asignado al sujeto obligado",1,0.5,"Requerimiento","En el formato nuevo \"2018 y ejercicios posteriores\" deberá borrar los ejercicios anteriores a 2018 por que ya estan contenidos en el formato \"2015-2017\"."]
[null,null,"Criterio 4. Clave del capítulo de gasto",1,0.5,"Requerimiento","En el formato nuevo \"2018 y ejercicios posteriores\" deberá borrar los ejercicios anteriores a 2018 por que ya estan contenidos en el formato \"2015-2017\"."]
[null,null,"Criterio 5. Denominación del capítulo de gasto",1,0.5,"Requerimiento","En el formato nuevo \"2018 y ejercicios posteriores\" deberá borrar los ejercicios anteriores a 2018 por que ya estan contenidos en el formato \"2015-2017\"."]
[null,null,"Criterio 6. Presupuesto por capítulo de gasto. Con base en el Clasificador por Objeto de Gasto que le corresponda al sujeto obligado",1,0.5,"Requerimiento","En el formato nuevo \"2018 y ejercicios posteriores\" deberá borrar los ejercicios anteriores a 2018 por que ya estan contenidos en el formato \"2015-2017\"."]
[null,null,"Criterio 7. Hipervínculo al Presupuesto de Egresos que le corresponda al sujeto obligado",1,0.5,"Requerimiento","En el formato nuevo \"2018 y ejercicios posteriores\" deberá borrar los ejercicios anteriores a 2018 por que ya estan contenidos en el formato \"2015-2017\"."]
[null,null,"Criterio 8. Hipervínculo a la página de internet denominada “Transparencia Presupuestaria observatorio del gasto”",1,0.5,"Requerimiento","En el formato nuevo \"2018 y ejercicios posteriores\" deberá borrar los ejercicios anteriores a 2018 por que ya estan contenidos en el formato \"2015-2017\"."]
[null,null,"Criterio 9. Ejercicio",1,1]
[null,null,"Criterio 10. Periodo que se informa (fecha de inicio y fecha de término con el formato día/mes/año)",1,1]
[null,null,"Criterio 11. Clave del capítulo de gasto",1,1]
[null,null,"Criterio 12. Denominación del Capítulo de gasto",1,1]
[null,null,"Criterio 13. Presupuesto aprobado",1,1]
[null,null,"Criterio 14. Ampliación / (Reducciones)",1,1]
[null,null,"Criterio 15. Modificado",1,1]
[null,null,"Criterio 16. Devengado",1,1]
[null,null,"Criterio 17. Pagado",1,1]
[null,null,"Criterio 18. Subejercicio",1,1]
[null,null,"Criterio 19. Hipervínculo al Estado analítico del ejercicio del Presupuesto de Egresos",1,1]
[null,null,"Criterio 20. Ejercicio",1,1]
[null,null,"Criterio 21. Periodo que se informa (fecha de inicio y fecha de término con el formato día/mes/año)",{"$f":"IF(E62=\"Justificado\",0,1)","v":1},1]
[null,null,"Criterio 22. Hipervínculo a la página de internet en donde se publique la Cuenta Pública consolidada por la instancia correspondiente según el orden de gobierno de que se trate",{"$f":"IF(E63=\"Justificado\",0,1)","v":0},"Justificado"]
[]
[null,null,"Criterios Adjetivos LTG 2018 - LTG 2020 (DOF 28/12/20) "]
[]
[null,null,"Criterio",null,"Valoración","Tipo","Observaciones, Recomendaciones y/o Requerimientos"]
[null,null,"Criterio 23. Periodo de actualización de la información: trimestral y anual respecto del presupuesto anual asignado y la cuenta pública ",{"$f":"IF(E68=\"Justificado\",0,1)","v":1},1]
[null,null,"Criterio 24. La información publicada deberá estar actualizada al periodo que corresponde de acuerdo con la Tabla de actualización y conservación de la información",1,1]
[null,null,"Criterio 25. Conservar en el sitio de Internet: información del ejercicio en curso y la correspondiente a seis ejercicios anteriores",1,1]
[null,null,"Criterio 26. Área(s) responsable(s) que genera(n), posee(n), publica(n) y/o actualiza(n)la información ",1,1]
[null,null,"Criterio 27. Fecha de actualización de la información publicada con el formato día/mes/año ",1,1]
[null,null,"Criterio 28. Fecha de validación de la información publicada con el formato día/mes/año ",1,0.5,"Requerimiento","Existen registros que no contienen la información en el formato 21-A 2015-2017 de presupuesto asignado anual."]
[null,null,"Criterio 29. Nota. Este criterio se cumple en caso de que sea necesario que el sujeto obligado incluya alguna aclaración relativa a la información publicada y/o explicación por la falta de información ",1,1]
[null,null,"Criterio 30. La información publicada se organiza mediante los formatos 21a, 21b y 21c, en los que se incluyen todos los campos especificados en los criterios sustantivos de contenido",1,1]
[null,null,"Criterio 31. El soporte de la información permite su reutilización",1,1]
{"$rows_empty":7}
[{"$nulls":3},2017,2018]
[null,null,"CS",{"$f":"IF(Aplicabilidad!G32<>\"SI\",\"NA\",SUM(E19:E34)/SUM(D19:D34))","v":{"v":1,"d":"100.00%"}},{"$f":"IF(Aplicabilidad!G32<>\"SI\",\"NA\",SUM(E42:E63)/SUM(D42:D63))","v":{"v":0.8095238095238095,"d":"80.95%"}}]
[null,null,"CA",{"$f":"IF(Aplicabilidad!G32<>\"SI\",\"NA\",SUM(#REF!)/SUM(#REF!))","v":{"$error":"#REF!"}},{"$f":"IF(Aplicabilidad!G32<>\"SI\",\"NA\",SUM(E68:E76)/SUM(D68:D76))","v":{"v":0.9444444444444444,"d":"94.44%"}}]
[null,null,"OBLIGACIÓN",{"$f":"IF(Aplicabilidad!G32<>\"SI\",\"NA\",D85*0.6+D86*0.4)","v":{"$error":"#REF!"}},{"$f":"IF(Aplicabilidad!G32<>\"SI\",\"NA\",E85*0.6+E86*0.4)","v":{"v":0.8634920634920635,"d":"86.35%"}}]

{"sheet":"Art 74_XXII","index":24,"n_rows":101,"n_cols":7,"rows_kept":101,"hidden":true,"merged":[[0,2,0,6],[4,1,4,7],[14,4,14,6],[47,4,47,6]]}
[null,null,{"$f":"IF(Aplicabilidad!E2=\"\",\"\",Aplicabilidad!E2)","v":"Consejería Jurídica"}]
[]
[null,"Códigos de valoración : Cumplió totalmente = 1; Cumplió parcialmente = 0.5; No cumplió = 0; Justificado = Justificado"]
[]
[null,"Art. 74 - Fracción XXII. Deuda pública"]
[]
[null,null,"Fecha de Inicio de la Verificación:",{"$nulls":3},"Fecha de Término de la verificación"]
[null,null,{"$f":"IF(Resultados!$C$7=\"\",\"\",Resultados!$C$7)","v":"2021-07-07"},"2018-05-25",null,null,{"$f":"IF(Resultados!G7=\"\",\"\",Resultados!G7)","v":"2021-07-08"}]
[]
[null,null,"Criterios Sustantivos",null,{"$f":"IF(Aplicabilidad!G33<>\"SI\",\"NA\",(SUM(E19:E44)+SUM(E52:E77))/(SUM(D19:D44)+SUM(D52:D77)))","v":"NA"}]
[null,null,"Criterios Adjetivos",null,{"$f":"IF(Aplicabilidad!G33<>\"SI\",\"NA\",(SUM(E82:E90))/(SUM(D82:D90)))","v":"NA"}]
[null,null,"Obligación",null,{"$f":"IF(Aplicabilidad!G33<>\"SI\",\"NA\",E10*0.6+E11*0.4)","v":"NA"}]
[]
[]
[]
[null,null,"Criterios Sustantivos de contenido \nLTG 2018 - LTG 2020 (DOF 28/12/20) ",{"$f":"COUNTA(F19:F45)","v":0}]
[]
[null,null,"Criterio",null,"Valoración","Tipo","Observaciones, Recomendaciones y/o Requerimientos"]
[null,null,"Criterio 1. Ejercicio",{"$f":"IF(E19=\"Justificado\",0,1)","v":1}]
[null,null,"Criterio 2. Periodo que se informa",{"$f":"IF(E20=\"Justificado\",0,1)","v":1}]
[null,null,"Criterio 3. Acreditado (sujeto obligado que contrae la obligación)",1]
[null,null,"Criterio 4. Denominación de la instancia ejecutora del recurso público",1]
[null,null,"Criterio 5. Tipo de obligación: Crédito simple / Crédito en cuenta corriente / Emisión bursátil / Garantía de pago oportuno (GPO) / Contratos de proyectos de prestación de servicios (PPS)",1]
[null,null,"Criterio 6. Acreedor (Institución que otorgó el crédito)",1]
[null,null,"Criterio 7. Fecha de firma del contrato o instrumento jurídico en el cual se contrajo la obligación, publicada con el formato día/mes/año (por ej. 31/Marzo/2016)",1]
[null,null,"Criterio 8. Monto original contratado, el cual consta en el contrato o instrumento jurídico en el que se contrajo la obligación",1]
[null,null,"Criterio 9. Plazo de tasa de interés pactado en el contrato o instrumento jurídico en el cual se contrajo la obligación (mensual, semestral, anual, etcétera)",1]
[null,null,"Criterio 10. Tasa de interés pactada en el contrato o instrumento jurídico en el cual se contrajo la obligación",1]
[null,null,"Criterio 11. Plazo pactado para pagar la deuda, el cual consta en el contrato o instrumento jurídico en el que se contrajo la obligación (especificar el número de meses)",1]
[null,null,"Criterio 12. Fecha de vencimiento de la deuda que conste en el contrato o instrumento jurídico en el que se contrajo la obligación, con el formato día/mes/año (por ej. 31/Marzo/2016)",1]
[null,null,"Criterio 13. Recurso afectado como fuente o garantía de pago",1]
[null,null,"Criterio 14. Destino para el cual fue contraída la obligación",1]
[null,null,"Criterio 15. Saldo al periodo que se reporta",1]
[null,null,"Criterio 16. Hipervínculo a la autorización de la propuesta de endeudamiento que en su caso se haya presentado",1]
[null,null,"Criterio 17. Hipervínculo al listado de resoluciones negativas a la contratación de financiamiento para las entidades distintas al gobierno federal",1]
[null,null,"Criterio 18. Hipervínculo al contrato o instrumento jurídico en el cual se contrajo la obligación",1]
[null,null,"Criterio 19. En su caso, el documento o instrumento en el cual se hayan especificado modificaciones",1]
[null,null,"Criterio 20. Hipervínculo a la Información de finanzas públicas y deuda pública, publicado por la SHCP",1]
[null,null,"Criterio 21. Informe enviado a la SHCP o equivalente de la entidad federativa que contenga el listado de todos los empréstitos y obligaciones de pago",1]
[null,null,"Criterio 22. Hipervínculo al informe de Cuenta Pública[5] enviado a la SHCP[6] u homóloga, en el cual se observe claramente el análisis correspondiente a la deuda pública que reportan",1]
[null,null,"Criterio 23. Fecha de inscripción en el Registro de Obligaciones y Empréstitos vigentes de Entidades, Municipios y sus Organismos, en su caso",1]
[null,null,"Criterio 24. Hipervínculo al Informe consolidado de la deuda pública de entidades federativas y municipios",1]
[null,null,"Criterio 25. Hipervínculo al informe consolidado de Cuenta Pública",{"$f":"IF(E43=\"Justificado\",0,1)","v":1}]
[null,null,"Criterio 26. Hipervínculo a la propuesta y reportes que genere la SHCP en caso de deuda pública externa contraída con organismos financieros internacionales",{"$f":"IF(E44=\"Justificado\",0,1)","v":1}]
[]
[]
[]
[]
[null,null,"Criterios Sustantivos de contenido LTG 2018 - LTG 2020 (DOF 28/12/20) ",{"$f":"COUNTA(F52:F90)","v":1}]
[]
[null,null,"Criterio",null,"Valoración","Tipo","Observaciones, Recomendaciones y/o Requerimientos"]
[null,null,"Criterio 1. Ejercicio",{"$f":"IF(E52=\"Justificado\",0,1)","v":1}]
[null,null,"Criterio 2. Periodo que se informa (fecha de inicio y fecha de término con el formato día/mes/año)",{"$f":"IF(E53=\"Justificado\",0,1)","v":1}]
[null,null,"Criterio 3. Acreditado (sujeto obligado que contrae la obligación)",1]
[null,null,"Criterio 4. Denominación de la instancia ejecutora del recurso público",1]
[null,null,"Criterio 5. Tipo de obligación (catálogo): Crédito simple/Crédito en cuenta corriente/Emisión bursátil/Garantía de pago oportuno (GPO)/Contratos de proyectos de prestación de servicios (PPS)",1]
[null,null,"Criterio 6. Acreedor (Institución que otorgó el crédito)",1]
[null,null,"Criterio 7. Fecha de firma del contrato o instrumento jurídico en el cual se contrajo la obligación, publicada con el formato día/mes/año",1]
[null,null,"Criterio 8. Monto original contratado, el cual consta en el contrato o instrumento jurídico en el que se contrajo la obligación",1]
[null,null,"Criterio 9. Plazo de tasa de interés pactado en el contrato o instrumento jurídico en el cual se contrajo la obligación. Por ejemplo, mensual, semestral, anual",1]
[null,null,"Criterio 10. Tasa de interés pactada en el contrato o instrumento jurídico en el cual se contrajo la obligación",1]
[null,null,"Criterio 11. Plazo pactado para pagar la deuda, el cual consta en el contrato o instrumento jurídico en el que se contrajo la obligación (especificar el número de meses)",1]
[null,null,"Criterio 12. Fecha de vencimiento de la deuda que conste en el contrato o instrumento jurídico en el que se contrajo la obligación, con el formato día/mes/año",1]
[null,null,"Criterio 13. Recurso afectado como fuente o garantía de pago",1]
[null,null,"Criterio 14. Destino para el cual fue contraída la obligación",1]
[null,null,"Criterio 15. Saldo al periodo que se informa",1]
[null,null,"Criterio 16. Hipervínculo a la autorización de la propuesta de endeudamiento que en su caso se haya presentado",1]
[null,null,"Criterio 17. Hipervínculo al listado de resoluciones negativas a la contratación de financiamiento para las entidades distintas al gobierno federal",1]
[null,null,"Criterio 18. Hipervínculo al contrato o instrumento jurídico en el cual se contrajo la obligación",1]
[null,null,"Criterio 19. En su caso, hipervínculo al documento o instrumento en el cual se hayan especificado modificaciones",1]
[null,null,"Criterio 20. Hipervínculo a la Información estadística de finanzas públicas y deuda pública, publicado por la SHCP",1]
[null,null,"Criterio 21. Hipervínculo al informe enviado a la SHCP o equivalente de la entidad federativa que contenga el listado de todos los empréstitos y obligaciones de pago",1]
[null,null,"Criterio 22. Hipervínculo al informe de Cuenta Pública[5] enviado a la SHCP[6] u homóloga, en el cual se observe claramente el análisis correspondiente a la deuda pública que reportan",1]
[null,null,"Criterio 23. Fecha de inscripción en el Registro de Obligaciones y Empréstitos vigentes de Entidades, Municipios y sus Organismos, en su caso",1]
[null,null,"Criterio 24. Hipervínculo al Informe consolidado de la deuda pública de entidades federativas y municipios",1]
[null,null,"Criterio 25. Hipervínculo al informe consolidado de Cuenta Pública",{"$f":"IF(E76=\"Justificado\",0,1)","v":1}]
[null,null,"Criterio 26. Hipervínculo a la propuesta y reportes que genere la SHCP en caso de deuda pública externa contraída con organismos financieros internacionales",{"$f":"IF(E77=\"Justificado\",0,1)","v":1}]
[]
[null,null,"Criterios Adjetivos LTG 2018 - LTG 2020 (DOF 28/12/20) "]
[]
[null,null,"Criterio",null,"Valoración","Tipo","Observaciones, Recomendaciones y/o Requerimientos"]
[null,null,"Criterio 27. Periodo de actualización de la información: trimestral - Párrafo modificado DOF 28/12/2020",{"$f":"IF(E82=\"Justificado\",0,1)","v":1}]
[null,null,"Criterio 28. La información publicada deberá estar actualizada al periodo que corresponde de acuerdo con la Tabla de actualización y conservación de la información",1]
[null,null,"Criterio 29. Conservar en el sitio de Internet y a través de la Plataforma Nacional la información vigente de acuerdo con la Tabla de actualización y conservación de la información",1]
[null,null,"Criterio 30. Área(s) responsable(s) que genera(n), posee(n), publica(n) y/o actualiza(n)la información ",1]
[null,null,"Criterio 31. Fecha de actualización de la información publicada con el formato día/mes/año ",1]
[null,null,"Criterio 32. Fecha de validación de la información publicada con el formato día/mes/año ",1]
[null,null,"Criterio 33. Nota. Este criterio se cumple en caso de que sea necesario que el sujeto obligado incluya alguna aclaración relativa a la información publicada y/o explicación por la falta de información ",1]
[null,null,"Criterio 34. La información publicada se organiza mediante el formato 22, en el que se incluyen todos los campos especificados en los criterios sustantivos de contenido",1]
[null,null,"Criterio 35. El soporte de la información permite su reutilización",1]
{"$rows_empty":7}
[{"$nulls":3},2017,2018]
[null,null,"CS",{"$f":"IF(Aplicabilidad!G33<>\"SI\",\"NA\",SUM(E19:E44)/SUM(D19:D44))","v":"NA"},{"$f":"IF(Aplicabilidad!G33<>\"SI\",\"NA\",SUM(E52:E77)/SUM(D52:D77))","v":"NA"}]
[null,null,"CA",{"$f":"IF(Aplicabilidad!G33<>\"SI\",\"NA\",SUM(#REF!)/SUM(#REF!))","v":"NA"},{"$f":"IF(Aplicabilidad!G33<>\"SI\",\"NA\",SUM(E82:E90)/SUM(D82:D90))","v":"NA"}]
[null,null,"OBLIGACIÓN",{"$f":"IF(Aplicabilidad!G33<>\"SI\",\"NA\",D99*0.6+D100*0.4)","v":"NA"},{"$f":"IF(Aplicabilidad!G33<>\"SI\",\"NA\",E99*0.6+E100*0.4)","v":"NA"}]

{"sheet":"Art 74_XXIII","index":25,"n_rows":220,"n_cols":7,"rows_kept":220,"hidden":true,"merged":[[0,2,0,6],[4,1,4,7],[14,4,14,6],[104,4,104,6]]}
[null,null,{"$f":"IF(Aplicabilidad!E2=\"\",\"\",Aplicabilidad!E2)","v":"Consejería Jurídica"}]
[]
[null,"Códigos de valoración : Cumplió totalmente = 1; Cumplió parcialmente = 0.5; No cumplió = 0; Justificado = Justificado"]
[]
[null,"Art. 74 - Fracción XXIII. Comunicación social y publicidad"]
[]
[null,null,"Fecha de Inicio de la Verificación:",{"$nulls":3},"Fecha de Término de la verificación"]
[null,null,{"$f":"IF(Resultados!$C$7=\"\",\"\",Resultados!$C$7)","v":"2021-07-07"},"2018-05-25",null,null,{"$f":"IF(Resultados!G7=\"\",\"\",Resultados!G7)","v":"2021-07-08"}]
[]
[null,null,"Criterios Sustantivos",null,{"$f":"IF(Aplicabilidad!G34<>\"SI\",\"NA\",(SUM(E19:E101)+SUM(E109:E196))/(SUM(D19:D101)+SUM(D109:D196)))","v":"NA"}]
[null,null,"Criterios Adjetivos",null,{"$f":"IF(Aplicabilidad!G34<>\"SI\",\"NA\",(SUM(E201:E209))/(SUM(D201:D209)))","v":"NA"}]
[null,null,"Obligación",null,{"$f":"IF(Aplicabilidad!G34<>\"SI\",\"NA\",E10*0.6+E11*0.4)","v":"NA"}]
[]
[]
[]
[null,null,"Criterios Sustantivos de contenido \nLTG 2018 - LTG 2020 (DOF 28/12/20) ",{"$f":"COUNTA(F19:F102)","v":0}]
[]
[null,null,"Criterio",null,"Valoración","Tipo","Observaciones, Recomendaciones y/o Requerimientos"]
[null,null,"Criterio 1. Ejercicio",{"$f":"IF(E19=\"Justificado\",0,1)","v":0},"Justificado"]
[null,null,"Criterio 2. Denominación del documento del programa anual de Comunicación Social",{"$f":"IF(E20=\"Justificado\",0,1)","v":0},"Justificado"]
[null,null,"Criterio 3. Fecha en la que se aprobó el Programa Anual de Comunicación Social por la instancia correspondiente",0,"Justificado"]
[null,null,"Criterio 4. Hipervínculo al Programa Anual de Comunicación Social o equivalente, que sea vigente y aplicable al sujeto obligado",0,"Justificado"]
[null,null,"Criterio 5. Función del sujeto obligado: contratante, solicitante o contratante y solicitante",0,"Justificado"]
[null,null,"Criterio 6. Área administrativa encargada de solicitar el servicio o producto, en su caso",0,"Justificado"]
[null,null,"Criterio 7. Clasificación del(los) servicios: Servicio de difusión en medios de comunicación / Otros servicios asociados a la comunicación / Erogación de recursos por contratación de servicios de impresión, difusión y publicidad / Utilización de los Tiempos Oficiales: tiempo de Estado y tiempo fiscal",0,"Justificado"]
[null,null,"Criterio 8. Ejercicio",0,"Justificado"]
[null,null,"Criterio 9. Periodo que se informa",0,"Justificado"]
[null,null,"Criterio 10. Tipo de servicio",0,"Justificado"]
[null,null,"Criterio 11. Tipo de medio: Internet / Radio / Televisión / Cine / Medios impresos / Medios digitales /Espectaculares / Medios complementarios[1] / Otros servicios asociados[2]/ Otro (especificar)",0,"Justificado"]
[null,null,"Criterio 12. Descripción de unidad, por ejemplo: spot de 30 segundos (radio); ½ plana (periódico); cine segundos, revistas, folletos",0,"Justificado"]
[null,null,"Criterio 13. Tipo: campaña o aviso institucional",0,"Justificado"]
[null,null,"Criterio 14. Nombre de la campaña o aviso Institucional",0,"Justificado"]
[null,null,"Criterio 15. Año de la campaña",0,"Justificado"]
[null,null,"Criterio 16. Tema de la campaña o aviso institucional",0,"Justificado"]
[null,null,"Criterio 17. Objetivo institucional",0,"Justificado"]
[null,null,"Criterio 18. Objetivo de comunicación",0,"Justificado"]
[null,null,"Criterio 19. Costo por unidad",0,"Justificado"]
[null,null,"Criterio 20. Clave única o número de identificación de campaña, aviso institucional o análogo",0,"Justificado"]
[null,null,"Criterio 21. Autoridad que proporcionó la clave única de identificación de campaña publicitaria o aviso institucional, o el número análogo de identificación de la campaña",0,"Justificado"]
[null,null,"Criterio 22. Cobertura Internacional / Nacional / Estatal / Delegacional o municipal",0,"Justificado"]
[null,null,"Criterio 23. Ámbito geográfico de cobertura, en su caso",0,"Justificado"]
[null,null,"Criterio 24. Fecha de inicio de la campaña o aviso institucional con el formato día/mes/año (por ej. 31/Marzo/2016)",0,"Justificado"]
[null,null,"Criterio 25. Fecha de término de la campaña o aviso institucional con el formato día/mes/año (por ej. 31/Marzo/2016)",0,"Justificado"]
[null,null,"Criterio 26. Sexo",0,"Justificado"]
[null,null,"Criterio 27. Lugar de residencia",0,"Justificado"]
[null,null,"Criterio 28. Nivel educativo",0,"Justificado"]
[null,null,"Criterio 29. Grupo de edad",0,"Justificado"]
[null,null,"Criterio 30. Nivel socioeconómico",0,"Justificado"]
[null,null,"Criterio 31. Razón social o nombre completo del (los) proveedor(es) y/o responsable(s) de publicar la campaña o la comunicación correspondiente (nombre[s], primer apellido y segundo apellido en caso de ser persona física)",0,"Justificado"]
[null,null,"Criterio 32. Nombre comercial del (los) proveedor(es) y/o responsable(s)",0,"Justificado"]
[null,null,"Criterio 33. Registro Federal de Contribuyentes de la persona física o moral proveedora del producto o servicio publicitario",0,"Justificado"]
[null,null,"Criterio 34. Procedimiento de contratación: licitación pública, adjudicación directa, invitación restringida",0,"Justificado"]
[null,null,"Criterio 35. Fundamento jurídico del proceso de contratación",0,"Justificado"]
[null,null,"Criterio 36. Descripción breve de las razones que justifican la elección de tal proveedor",0,"Justificado"]
[null,null,"Criterio 37. Partida genérica",0,"Justificado"]
[null,null,"Criterio 38. Clave del concepto (conforme al clasificador por objeto del gasto)",0,"Justificado"]
[null,null,"Criterio 39. Nombre del concepto (conforme al clasificador por objeto del gasto)",0,"Justificado"]
[null,null,"Criterio 40. Presupuesto asignado por concepto",0,"Justificado"]
[null,null,"Criterio 41. Presupuesto modificado por concepto",0,"Justificado"]
[null,null,"Criterio 42. Presupuesto total ejercido por concepto al periodo reportado",0,"Justificado"]
[null,null,"Criterio 43. Denominación de cada partida",0,"Justificado"]
[null,null,"Criterio 44. Presupuesto total asignado a cada partida",0,"Justificado"]
[null,null,"Criterio 45. Presupuesto modificado por partida",0,"Justificado"]
[null,null,"Criterio 46. Presupuesto ejercido al periodo reportado de cada partida",0,"Justificado"]
[null,null,"Criterio 47. Fecha de firma de contrato con el formato día/mes/año (por ej. 31/Marzo/2016)",0,"Justificado"]
[null,null,"Criterio 48. Número o referencia de identificación del contrato",0,"Justificado"]
[null,null,"Criterio 49. Objeto del contrato",0,"Justificado"]
[null,null,"Criterio 50. Hipervínculo al contrato firmado",0,"Justificado"]
[null,null,"Criterio 51. Hipervínculo al convenio modificatorio, en su caso",0,"Justificado"]
[null,null,"Criterio 52. Monto total del contrato",0,"Justificado"]
[null,null,"Criterio 53. Monto pagado al periodo publicado",0,"Justificado"]
[null,null,"Criterio 54. Fecha de inicio de los servicios contratados con el formato día/mes/año (por ej. 31/Marzo/2016)",0,"Justificado"]
[null,null,"Criterio 55. Fecha de término de los servicios contratados con el formato día/mes/año (por ej. 31/Marzo/2016)",0,"Justificado"]
[null,null,"Criterio 56. Número de factura",0,"Justificado"]
[null,null,"Criterio 57. Hipervínculo a la factura",0,"Justificado"]
[null,null,"Criterio 58. Ejercicio",0,"Justificado"]
[null,null,"Criterio 59. Periodo que se informa",0,"Justificado"]
[null,null,"Criterio 60. Sujeto obligado al que se le proporcionó el servicio/permiso",0,"Justificado"]
[null,null,"Criterio 61. Tipo: Tiempo de Estado / Tiempo fiscal",0,"Justificado"]
[null,null,"Criterio 62. Medio de comunicación",0,"Justificado"]
[null,null,"Criterio 63. Descripción de unidad, por ejemplo: spot de 30 segundos (radio/televisión)",0,"Justificado"]
[null,null,"Criterio 64. Concepto o campaña",0,"Justificado"]
[null,null,"Criterio 65. Clave única de identificación de campaña o aviso institucional, en su caso",0,"Justificado"]
[null,null,"Criterio 66. Autoridad que proporcionó la clave única de identificación de campaña o aviso institucional",{"$f":"IF(E84=\"Justificado\",0,1)","v":0},"Justificado"]
[null,null,"Criterio 67. Cobertura: internacional, nacional, estatal, delegacional o municipal",0,"Justificado"]
[null,null,"Criterio 68. Ámbito geográfico de cobertura",0,"Justificado"]
[null,null,"Criterio 69. Sexo",0,"Justificado"]
[null,null,"Criterio 70. Lugar de residencia",0,"Justificado"]
[null,null,"Criterio 71. Nivel educativo",0,"Justificado"]
[null,null,"Criterio 72. Grupo de edad",0,"Justificado"]
[null,null,"Criterio 73. Nivel socioeconómico",0,"Justificado"]
[null,null,"Criterio 74. Concesionario responsable de publicar la campaña o la comunicación correspondiente (razón social)",0,"Justificado"]
[null,null,"Criterio 75. Nombre comercial del concesionario responsable de publicar la campaña o comunicación",0,"Justificado"]
[null,null,"Criterio 76. Descripción breve de las razones que justifican la elección del proveedor",0,"Justificado"]
[null,null,"Criterio 77. Monto total del tiempo de Estado o tiempo fiscal consumidos (con el formato: horas/minutos/segundos)",0,"Justificado"]
[null,null,"Criterio 78. Área administrativa encargada de solicitar la difusión del mensaje o producto, en su caso",0,"Justificado"]
[null,null,"Criterio 79. Fecha de inicio de difusión del concepto o campaña en el formato día/mes/año (por ej. 31/Marzo/2016)",0,"Justificado"]
[null,null,"Criterio 80. Fecha de término de difusión del concepto o campaña con el formato día/mes/año (por ej. 31/Marzo/2016)",0,"Justificado"]
[null,null,"Criterio 81. Presupuesto total asignado a cada partida",0,"Justificado"]
[null,null,"Criterio 82. Presupuesto ejercido al periodo reportado de cada partida",{"$f":"IF(E100=\"Justificado\",0,1)","v":0},"Justificado"]
[null,null,"Criterio 83. Número de factura, en su caso",{"$f":"IF(E101=\"Justificado\",0,1)","v":0},"Justificado"]
[]
[]
[]
[]
[null,null,"Criterios Sustantivos de contenido\n LTG 2018 - LTG 2020 (DOF 28/12/20) ",{"$f":"COUNTA(F109:F209)","v":1}]
[]
[null,null,"Criterio",null,"Valoración","Tipo","Observaciones, Recomendaciones y/o Requerimientos"]
[null,null,"Criterio 1. Ejercicio",{"$f":"IF(E109=\"Justificado\",0,1)","v":1}]
[null,null,"Criterio 2. Periodo que se informa (fecha de inicio y fecha de término con el formato día/mes/año)",{"$f":"IF(E110=\"Justificado\",0,1)","v":1}]
[null,null,"Criterio 3. Denominación del documento del Programa Anual de Comunicación Social o equivalente",1]
[null,null,"Criterio 4. Fecha en la que se aprobó el Programa Anual de Comunicación Social por la instancia correspondiente",1]
[null,null,"Criterio 5. Hipervínculo al Programa Anual de Comunicación Social o equivalente, que sea vigente y aplicable al sujeto obligado",1]
[null,null,"Criterio 6. Ejercicio",1]
[null,null,"Criterio 7. Periodo que se informa (fecha de inicio y fecha de término con el formato día/mes/año)",1]
[null,null,"Criterio 8. Función del sujeto obligado (catálogo): Contratante/ Solicitante/ Contratante y solicitante",1]
[null,null,"Criterio 9. Área administrativa encargada de solicitar el servicio o producto, en su caso",1]
[null,null,"Criterio 10. Clasificación del(los) servicios (catálogo): Servicio de difusión en medios de comunicación / Otros servicios asociados a la comunicación / Erogación de recursos por contratación de servicios de impresión, difusión y publicidad / Utilización de los Tiempos Oficiales: tiempo de Estado y tiempo fiscal",1]
[null,null,"Criterio 11. Tipo de servicio",1]
[null,null,"Criterio 12. Tipo de medio (catálogo): Internet/Radio/Televisión/Cine/Medios impresos/Medios digitales/Espectaculares/Medios complementarios[1]/Otros servicios asociados[2]/Otro (especificar)",1]
[null,null,"Criterio 13. Descripción de unidad, por ejemplo: spot de 30 segundos (radio); ½ plana (periódico); cine segundos, revistas, folletos",1]
[null,null,"Criterio 14. Tipo (catálogo): Campaña/ Aviso institucional",1]
[null,null,"Criterio 15. Nombre de la campaña o aviso Institucional, en su caso",1]
[null,null,"Criterio 16. Año de la campaña",1]
[null,null,"Criterio 17. Tema de la campaña o aviso institucional",1]
[null,null,"Criterio 18. Objetivo institucional",1]
[null,null,"Criterio 19. Objetivo de comunicación",1]
[null,null,"Criterio 20. Costo por unidad",1]
[null,null,"Criterio 21. Clave única o número de identificación de campaña, aviso institucional o análogo",1]
[null,null,"Criterio 22. Autoridad que proporcionó la clave única de identificación de campaña publicitaria o aviso institucional, o el número análogo de identificación de la campaña",1]
[null,null,"Criterio 23. Cobertura (catálogo): Internacional / Nacional / Estatal / Delegacional o municipal",1]
[null,null,"Criterio 24. Ámbito geográfico de cobertura, en su caso",1]
[null,null,"Criterio 25. Fecha de inicio de la campaña o aviso institucional con el formato día/mes/año",1]
[null,null,"Criterio 26. Fecha de término de la campaña o aviso institucional con el formato día/mes/año ",1]
[null,null,"Criterio 27. Sexo (catálogo): femenino/masculino/femenino y masculino",1]
[null,null,"Criterio 28. Lugar de residencia",1]
[null,null,"Criterio 29. Nivel educativo",1]
[null,null,"Criterio 30. Grupo de edad",1]
[null,null,"Criterio 31. Nivel socioeconómico",1]
[null,null,"Criterio 32. Razón social o nombre completo del (los) proveedor(es) y/o responsable(s) de publicar la campaña o la comunicación correspondiente (nombre[s], primer apellido y segundo apellido en caso de ser persona física)",1]
[null,null,"Criterio 33. Nombre del (los) proveedor(es) y/o responsable(s)",1]
[null,null,"Criterio 34. Registro Federal de Contribuyentes de la persona física o moral proveedora del producto o servicio publicitario",1]
[null,null,"Criterio 35. Procedimiento de contratación (catálogo): Licitación pública/Adjudicación directa/Invitación restringida",1]
[null,null,"Criterio 36. Fundamento jurídico del proceso de contratación",1]
[null,null,"Criterio 37. Descripción breve de las razones que justifican la elección de tal proveedor",1]
[null,null,"Criterio 38. Partida genérica",1]
[null,null,"Criterio 39. Clave del concepto (conforme al clasificador por objeto del gasto)",1]
[null,null,"Criterio 40. Nombre del concepto (conforme al clasificador por objeto del gasto)",1]
[null,null,"Criterio 41. Presupuesto asignado por concepto",1]
[null,null,"Criterio 42. Presupuesto modificado por concepto",1]
[null,null,"Criterio 43. Presupuesto total ejercido por concepto al periodo reportado",1]
[null,null,"Criterio 44. Denominación de cada partida",1]
[null,null,"Criterio 45. Presupuesto total asignado a cada partida",1]
[null,null,"Criterio 46. Presupuesto modificado por partida",1]
[null,null,"Criterio 47. Presupuesto ejercido al periodo reportado de cada partida",1]
[null,null,"Criterio 48. Fecha de firma de contrato con el formato día/mes/año ",1]
[null,null,"Criterio 49. Número o referencia de identificación del contrato",1]
[null,null,"Criterio 50. Objeto del contrato",1]
[null,null,"Criterio 51. Hipervínculo al contrato firmado",1]
[null,null,"Criterio 52. Hipervínculo al convenio modificatorio, en su caso",1]
[null,null,"Criterio 53. Monto total del contrato",1]
[null,null,"Criterio 54. Monto pagado al periodo publicado",1]
[null,null,"Criterio 55. Fecha de inicio de los servicios contratados con el formato día/mes/año",1]
[null,null,"Criterio 56. Fecha de término de los servicios contratados con el formato día/mes/año ",1]
[null,null,"Criterio 57. Número de factura",1]
[null,null,"Criterio 58. Hipervínculo a la factura",1]
[null,null,"Criterio 59. Ejercicio",1]
[null,null,"Criterio 60. Periodo que se informa (fecha de inicio y fecha de término con el formato día/mes/año)",1]
[null,null,"Criterio 61. Sujeto obligado al que se le proporcionó el servicio/permiso",1]
[null,null,"Criterio 62. Tipo (catálogo): Tiempo de Estado/Tiempo fiscal/Tiempo oficial",1]
[null,null,"Criterio 63. Medio de comunicación (catálogo): Televisión/ Radio",1]
[null,null,"Criterio 64. Descripción de unidad, por ejemplo: spot de 30 segundos (radio/televisión)",1]
[null,null,"Criterio 65. Concepto o campaña",1]
[null,null,"Criterio 66. Clave única de identificación de campaña o aviso institucional, en su caso",{"$f":"IF(E174=\"Justificado\",0,1)","v":1}]
[null,null,"Criterio 67. Autoridad que proporcionó la clave única de identificación de campaña o aviso institucional",1]
[null,null,"Criterio 68. Cobertura (catálogo): Internacional/ Nacional/ Estatal/ Delegacional o municipal",1]
[null,null,"Criterio 69. Ámbito geográfico de cobertura",1]
[null,null,"Criterio 70. Sexo (catálogo): Femenino/ Masculino/ Femenino y masculino",1]
[null,null,"Criterio 71. Lugar de residencia",1]
[null,null,"Criterio 72. Nivel educativo",1]
[null,null,"Criterio 73. Grupo de edad",1]
[null,null,"Criterio 74. Nivel socioeconómico",1]
[null,null,"Criterio 75. Concesionario responsable de publicar la campaña o la comunicación correspondiente (razón social)",1]
[null,null,"Criterio 76. Distintivo y/o nombre comercial del concesionario responsable de publicar la campaña o comunicación",1]
[null,null,"Criterio 77. Descripción breve de las razones que justifican la elección del proveedor",1]
[null,null,"Criterio 78. Monto total del tiempo de Estado o tiempo fiscal consumidos (con el formato: horas/minutos/segundos)",1]
[null,null,"Criterio 79. Área administrativa encargada de solicitar la difusión del mensaje o producto, en su caso",1]
[null,null,"Criterio 80. Fecha de inicio de difusión del concepto o campaña en el formato día/mes/año",1]
[null,null,"Criterio 81. Fecha de término de difusión del concepto o campaña con el formato día/mes/año ",1]
[null,null,"Criterio 82. Presupuesto total asignado a cada partida",1]
[null,null,"Criterio 83. Presupuesto ejercido al periodo reportado de cada partida",1]
[null,null,"Criterio 84. Número de factura, en su caso",1]
[null,null,"Criterio 85. Ejercicio",1]
[null,null,"Criterio 86. Periodo que se informa (fecha de inicio y fecha de término con el formato día/mes/año)",1]
[null,null,"Criterio 87. Publicar mensaje 1: “La publicación y actualización de la información relativa a la utilización de los Tiempos oficiales está a cargo de Dirección General de Radio, Televisión y Cinematografía de la Secretaría de Gobernación.”\n\nPublicar mensaje 2: “La publicación y actualización de la información relativa a la utilización de los Tiempos oficiales está a cargo del Instituto Nacional Electoral.”",{"$f":"IF(E195=\"Justificado\",0,1)","v":1}]
[null,null,"Criterio 88. Hipervínculo que dirija a la información relativa a la utilización de los Tiempos oficiales que publica el sujeto obligado referido en la Plataforma Nacional de Transparencia, en el Sistema de Portales de Obligaciones de Transparencia (SIPOT) - Criterio Modificado DOF 28/12/2020",{"$f":"IF(E196=\"Justificado\",0,1)","v":1}]
[]
[null,null,"Criterios Adjetivos LTG 2018 - LTG 2020 (DOF 28/12/20) "]
[]
[null,null,"Criterio",null,"Valoración","Tipo","Observaciones, Recomendaciones y/o Requerimientos"]
[null,null,"Criterio 89. Periodo de actualización de la información: trimestral; anual durante el primer trimestre, respecto del Programa Anual de Comunicación Social o equivalente - Párrafo modificado DOF 28/12/2020",{"$f":"IF(E201=\"Justificado\",0,1)","v":1}]
[null,null,"Criterio 90. La información deberá estar actualizada al periodo que corresponde de acuerdo con la Tabla de actualización y conservación de la información",1]
[null,null,"Criterio 91. Conservar en el sitio de Internet y a través de la Plataforma Nacional la información del ejercicio en curso y la correspondiente a dos ejercicios anteriores de acuerdo con la Tabla de actualización y conservación de la información",1]
[null,null,"Criterio 92. Área(s) responsable(s) que genera(n), posee(n), publica(n) y/o actualiza(n)la información ",1]
[null,null,"Criterio 93. Fecha de actualización de la información publicada con el formato día/mes/año ",1]
[null,null,"Criterio 94. Fecha de validación de la información publicada con el formato día/mes/año ",1]
[null,null,"Criterio 95. Nota. Este criterio se cumple en caso de que sea necesario que el sujeto obligado incluya alguna aclaración relativa a la información publicada y/o explicación por la falta de información",1]
[null,null,"Criterio 96. La información publicada se organiza mediante los formatos 23a, 23b, 23c y 23d en los que se incluyen todos los campos especificados en los criterios sustantivos de contenido",1]
[null,null,"Criterio 97. El soporte de la información permite su reutilización",1]
{"$rows_empty":7}
[{"$nulls":3},2017,2018]
[null,null,"CS",{"$f":"IF(Aplicabilidad!G34<>\"SI\",\"NA\",SUM(E19:E101)/SUM(D19:D101))","v":"NA"},{"$f":"IF(Aplicabilidad!G34<>\"SI\",\"NA\",SUM(E109:E196)/SUM(D109:D196))","v":"NA"}]
[null,null,"CA",{"$f":"IF(Aplicabilidad!G34<>\"SI\",\"NA\",SUM(#REF!)/SUM(#REF!))","v":"NA"},{"$f":"IF(Aplicabilidad!G34<>\"SI\",\"NA\",SUM(E201:E209)/SUM(D201:D209))","v":"NA"}]
[null,null,"OBLIGACIÓN",{"$f":"IF(Aplicabilidad!G34<>\"SI\",\"NA\",D218*0.6+D219*0.4)","v":"NA"},{"$f":"IF(Aplicabilidad!G34<>\"SI\",\"NA\",E218*0.6+E219*0.4)","v":"NA"}]

{"sheet":"Art 74_XXIV","index":26,"n_rows":98,"n_cols":7,"rows_kept":98,"merged":[[0,2,0,6],[4,1,4,7],[14,4,14,6],[45,4,45,6]]}
[null,null,{"$f":"IF(Aplicabilidad!E2=\"\",\"\",Aplicabilidad!E2)","v":"Consejería Jurídica"}]
[]
[null,"Códigos de valoración : Cumplió totalmente = 1; Cumplió parcialmente = 0.5; No cumplió = 0; Justificado = Justificado"]
[]
[null,"Art. 74 - Fracción XXIV. Resultados de auditorías"]
[]
[null,null,"Fecha de Inicio de la Verificación:",{"$nulls":3},"Fecha de Término de la verificación"]
[null,null,{"$f":"IF(Resultados!$C$7=\"\",\"\",Resultados!$C$7)","v":"2021-07-07"},"2018-05-25",null,null,{"$f":"IF(Resultados!G7=\"\",\"\",Resultados!G7)","v":"2021-07-08"}]
[]
[null,null,"Criterios Sustantivos",null,{"$f":"IF(Aplicabilidad!G35<>\"SI\",\"NA\",(SUM(E19:E42)+SUM(E50:E74))/(SUM(D19:D42)+SUM(D50:D74)))","v":{"v":0.9285714285714286,"d":"93%"}}]
[null,null,"Criterios Adjetivos",null,{"$f":"IF(Aplicabilidad!G35<>\"SI\",\"NA\",(SUM(E79:E87))/(SUM(D79:D87)))","v":{"v":1,"d":"100%"}}]
[null,null,"Obligación",null,{"$f":"IF(Aplicabilidad!G35<>\"SI\",\"NA\",E10*0.6+E11*0.4)","v":{"v":0.9571428571428572,"d":"95.71%"}}]
[]
[]
[]
[null,null,"Criterios Sustantivos de contenido \nLTG 2018 - LTG 2020 (DOF 28/12/20) ",{"$f":"COUNTA(F19:F43)","v":0}]
[]
[null,null,"Criterio",null,"Valoración","Tipo","Observaciones, Recomendaciones y/o Requerimientos"]
[null,null,"Criterio 1. Ejercicio en el que inició la auditoría o revisión",{"$f":"IF(E19=\"Justificado\",0,1)","v":0},"Justificado"]
[null,null,"Criterio 2. Periodo en el que se dio inicio a la auditoría",{"$f":"IF(E20=\"Justificado\",0,1)","v":0},"Justificado"]
[null,null,"Criterio 3. Ejercicio(s) auditado(s)",0,"Justificado"]
[null,null,"Criterio 4. Periodo auditado",0,"Justificado"]
[null,null,"Criterio 5. Rubro: Auditoría interna / Auditoría externa",0,"Justificado"]
[null,null,"Criterio 6. Tipo de auditoría, con base en la clasificación hecha por el órgano fiscalizador correspondiente",0,"Justificado"]
[null,null,"Criterio 7. Número de auditoría o nomenclatura que la identifique",0,"Justificado"]
[null,null,"Criterio 8. Órgano que realizó la revisión o auditoría",0,"Justificado"]
[null,null,"Criterio 9. Nomenclatura, número o folio que identifique el oficio o documento de apertura en el que se haya notificado el inicio de trabajo de revisión",0,"Justificado"]
[null,null,"Criterio 10. Nomenclatura, número o folio que identifique el oficio o documento de solicitud de información que será revisada",0,"Justificado"]
[null,null,"Criterio 11. Objetivo(s) de la realización de la auditoría",0,"Justificado"]
[null,null,"Criterio 12. Rubros sujetos a revisión",0,"Justificado"]
[null,null,"Criterio 13. Fundamentos legales (normas y legislaciones aplicables a la auditoría)",0,"Justificado"]
[null,null,"Criterio 14. Número de oficio o documento de notificación de resultados",0,"Justificado"]
[null,null,"Criterio 15. Hipervínculo al oficio o documento de notificación de resultados",0,"Justificado"]
[null,null,"Criterio 16. Por rubro sujeto a revisión, el número total de hallazgos, observaciones, conclusiones, recomendaciones, o lo que derive",0,"Justificado"]
[null,null,"Criterio 17. Hipervínculo a las recomendaciones y/u observaciones hechas al sujeto obligado, ordenadas por rubro sujeto a revisión",0,"Justificado"]
[null,null,"Criterio 18. Informes finales, de revisión y/o dictamen (puede tratarse de un texto libre o de un documento publicado en formato PDF, en el que se difundan firmas, cuyo formato debe permitir su reutilización)",0,"Justificado"]
[null,null,"Criterio 19. Tipo de acción promovida por el órgano fiscalizador, como pueden ser la emisión de una recomendación, pliego de observaciones, promoción del ejercicio de la facultad de comprobación fiscal, multa, responsabilidad administrativa sancionatoria, fincamiento de responsabilidad, denuncia de hechos, u otras de acuerdo con lo especificado por el órgano fiscalizador y la normatividad que corresponda[1]",0,"Justificado"]
[null,null,"Criterio 20. Servidor(a) público(a) y/o área del sujeto obligado responsable o encargada de recibir los resultados",0,"Justificado"]
[null,null,"Criterio 21. El total de solventaciones y/o aclaraciones realizadas",0,"Justificado"]
[null,null,"Criterio 22. En su caso, el informe sobre las aclaraciones realizadas por el sujeto obligado a las acciones promovidas por el órgano fiscalizador (puede tratarse de un texto libre o de un documento publicado en formato PDF, en el que se difundan firmas, cuyo formato debe permitir su reutilización)",0,"Justificado"]
[null,null,"Criterio 23. El total de acciones pendientes por solventar y/o aclarar ante el órgano fiscalizador",{"$f":"IF(E41=\"Justificado\",0,1)","v":0},"Justificado"]
[null,null,"Criterio 24. Hipervínculo al Programa Anual de Auditorías para la Fiscalización Superior de la Cuenta Pública[2] generado y publicado por la ASF, cuando se trate de auditorías practicadas al ejercicio de recursos públicos federales; o en su caso al Plan, Programa Anual u homólogo que genere la entidad estatal de fiscalización correspondiente[3]. Una vez que el Sistema Nacional de Fiscalización realice el Programa Anual de Auditorías derivado de dicho Sistema, se deberá publicar el hipervínculo al mismo.",{"$f":"IF(E42=\"Justificado\",0,1)","v":0},"Justificado"]
[]
[]
[]
[]
[null,null,"Criterios Sustantivos de contenido LTG 2018 - LTG 2020 (DOF 28/12/20) ",{"$f":"COUNTA(F50:F87)","v":3}]
[]
[null,null,"Criterio",null,"Valoración","Tipo","Observaciones, Recomendaciones y/o Requerimientos"]
[null,null,"Criterio 1. Ejercicio ",{"$f":"IF(E50=\"Justificado\",0,1)","v":1},1]
[null,null,"Criterio 2. Periodo que se informa (fecha de inicio y fecha de término con el formato día/mes/año)",{"$f":"IF(E51=\"Justificado\",0,1)","v":1},1]
[null,null,"Criterio 3. Ejercicio(s) auditado(s)",1,1]
[null,null,"Criterio 4. Periodo auditado",1,1]
[null,null,"Criterio 5. Rubro (catálogo): Auditoría interna/Auditoría externa",1,1]
[null,null,"Criterio 6. Tipo de auditoría, con base en la clasificación hecha por el órgano fiscalizador correspondiente",1,1]
[null,null,"Criterio 7. Número de auditoría o nomenclatura que la identifique",1,1]
[null,null,"Criterio 8. Órgano que realizó la revisión o auditoría",1,1]
[null,null,"Criterio 9. Nomenclatura, número o folio que identifique el oficio o documento de apertura en el que se haya notificado el inicio de trabajo de revisión",1,1]
[null,null,"Criterio 10. Nomenclatura, número o folio que identifique el oficio o documento de solicitud de información que será revisada",1,1]
[null,null,"Criterio 11. Nomenclatura, número o folio que identifique el oficio o documento de solicitud de información adicional que será revisada",1,0,"Requerimiento","Existen registros donde no hay información publicada ni nota informativa que justifique la falta de información."]
[null,null,"Criterio 12. Objetivo(s) de la realización de la auditoría",1,1]
[null,null,"Criterio 13. Rubros sujetos a revisión",1,1]
[null,null,"Criterio 14. Fundamentos legales (normas y legislaciones aplicables a la auditoría)",1,1]
[null,null,"Criterio 15. Número de oficio o documento de notificación de resultados",1,1]
[null,null,"Criterio 16. Hipervínculo al oficio o documento de notificación de resultados",1,1]
[null,null,"Criterio 17. Por rubro sujeto a revisión, el número total de hallazgos, observaciones, conclusiones, recomendaciones, o lo que derive",1,1]
[null,null,"Criterio 18. Hipervínculo a las recomendaciones y/u observaciones hechas al sujeto obligado, ordenadas por rubro sujeto a revisión",0,"Justificado"]
[null,null,"Criterio 19. Hipervínculo a los informes finales, de revisión y/o dictamen si es un documento publicado en formato PDF, en el que se difundan firmas, el formato debe permitir su reutilización)",1,1]
[null,null,"Criterio 20. Tipo de acción determinada por el órgano fiscalizador, como pueden ser la emisión de una recomendación, pliego de observaciones, promoción del ejercicio de la facultad de comprobación fiscal, multa, responsabilidad administrativa sancionatoria, fincamiento de responsabilidad, denuncia de hechos, u otras de acuerdo con lo especificado por el órgano fiscalizador y la normatividad que corresponda",0,"Justificado"]
[null,null,"Criterio 21. Nombre del Servidor(a) público(a) y/o área del sujeto obligado responsable o encargada de recibir los resultados",1,1]
[null,null,"Criterio 22. El total de solventaciones y/o aclaraciones realizadas",0,"Justificado"]
[null,null,"Criterio 23. En su caso, el hipervínculo al informe sobre las aclaraciones realizadas por el sujeto obligado a las acciones promovidas por el órgano fiscalizador si es  un documento publicado en formato PDF, en el que se difundan firmas, el formato debe permitir su reutilización)",0,"Justificado"]
[null,null,"Criterio 24. El total de acciones pendientes por solventar y/o aclarar ante el órgano fiscalizador",{"$f":"IF(E73=\"Justificado\",0,1)","v":1},1]
[null,null,"Criterio 25. Hipervínculo al Programa anual de auditoría que corresponda. El Programa Anual de Auditorías para la Fiscalización Superior de la Cuenta Pública[2] generado y publicado por la ASF, cuando se trate de auditorías practicadas al ejercicio de recursos públicos federales; o en su caso al Plan, Programa Anual u homólogo que genere la entidad estatal de fiscalización correspondiente[3]. Una vez que el Sistema Nacional de Fiscalización realice el Programa Anual de Auditorías derivado de dicho Sistema, se deberá publicar el hipervínculo al mismo. En el caso de los Partidos Políticos se vinculará al sistema homólogo del órgano fiscalizador que contenga la programación de las auditorías.\n\nPara las auditorías internas se deberá vincular al Programa Interno de Auditorías que corresponda. ",{"$f":"IF(E74=\"Justificado\",0,1)","v":1},0.5,"Requerimiento","Existen registros donde no hay información publicada ni nota informativa que justifique la falta de información."]
[]
[null,null,"Criterios Adjetivos LTG 2018 - LTG 2020 (DOF 28/12/20) "]
[]
[null,null,"Criterio",null,"Valoración","Tipo","Observaciones, Recomendaciones y/o Requerimientos"]
[null,null,"Criterio 26. Periodo de actualización de la información: trimestral",{"$f":"IF(E79=\"Justificado\",0,1)","v":1},1]
[null,null,"Criterio 27. La información deberá estar actualizada al periodo que corresponde de acuerdo con la Tabla de actualización y conservación de la información",1,1]
[null,null,"Criterio 28. Conservar en el sitio de Internet y a través de la Plataforma Nacional la Información generada en el ejercicio en curso y la correspondiente a los tres ejercicios anteriores",1,1]
[null,null,"Criterio 29. Área(s) responsable(s) que genera(n), posee(n), publica(n) y/o actualiza(n)la información  ",1,1]
[null,null,"Criterio 30. Fecha de actualización de la información publicada con el formato día/mes/año ",1,1]
[null,null,"Criterio 31. Fecha de validación de la información publicada con el formato día/mes/año ",1,1]
[null,null,"Criterio 32. Nota. Este criterio se cumple en caso de que sea necesario que el sujeto obligado incluya alguna aclaración relativa a la información publicada y/o explicación por la falta de información ",1,1]
[null,null,"Criterio 33. La información publicada se organiza mediante el formato 24, en el que se incluyen todos los campos especificados en los criterios sustantivos de contenido",1,1]
[null,null,"Criterio 34. El soporte de la información permite su reutilización",1,1]
{"$rows_empty":7}
[{"$nulls":3},2017,2018]
[null,null,"CS",{"$f":"IF(Aplicabilidad!G35<>\"SI\",\"NA\",SUM(E19:E42)/SUM(D19:D42))","v":{"$error":"#DIV/0!"}},{"$f":"IF(Aplicabilidad!G35<>\"SI\",\"NA\",SUM(E50:E74)/SUM(D50:D74))","v":{"v":0.9285714285714286,"d":"92.86%"}}]
[null,null,"CA",{"$f":"IF(Aplicabilidad!G35<>\"SI\",\"NA\",SUM(#REF!)/SUM(#REF!))","v":{"$error":"#REF!"}},{"$f":"IF(Aplicabilidad!G35<>\"SI\",\"NA\",SUM(E79:E87)/SUM(D79:D87))","v":{"v":1,"d":"100.00%"}}]
[null,null,"OBLIGACIÓN",{"$f":"IF(Aplicabilidad!G35<>\"SI\",\"NA\",D96*0.6+D97*0.4)","v":{"$error":"#DIV/0!"}},{"$f":"IF(Aplicabilidad!G35<>\"SI\",\"NA\",E96*0.6+E97*0.4)","v":{"v":0.9571428571428572,"d":"95.71%"}}]

{"sheet":"Art 74_XXV","index":27,"n_rows":68,"n_cols":7,"rows_kept":68,"hidden":true,"merged":[[0,2,0,6],[4,1,4,7],[14,4,14,6],[30,4,30,6]]}
[null,null,{"$f":"IF(Aplicabilidad!E2=\"\",\"\",Aplicabilidad!E2)","v":"Consejería Jurídica"}]
[]
[null,"Códigos de valoración : Cumplió totalmente = 1; Cumplió parcialmente = 0.5; No cumplió = 0; Justificado = Justificado"]
[]
[null,"Art. 74 - Fracción XXV. Dictámenes estados financieros"]
[]
[null,null,"Fecha de Inicio de la Verificación:",{"$nulls":3},"Fecha de Término de la verificación"]
[null,null,{"$f":"IF(Resultados!$C$7=\"\",\"\",Resultados!$C$7)","v":"2021-07-07"},"2018-05-25",null,null,{"$f":"IF(Resultados!G7=\"\",\"\",Resultados!G7)","v":"2021-07-08"}]
[]
[null,null,"Criterios Sustantivos",null,{"$f":"IF(Aplicabilidad!G36<>\"SI\",\"NA\",(SUM(E19:E27)+SUM(E35:E44))/(SUM(D19:D27)+SUM(D35:D44)))","v":"NA"}]
[null,null,"Criterios Adjetivos",null,{"$f":"IF(Aplicabilidad!G36<>\"SI\",\"NA\",(SUM(E49:E57))/(SUM(D49:D57)))","v":"NA"}]
[null,null,"Obligación",null,{"$f":"IF(Aplicabilidad!G36<>\"SI\",\"NA\",E10*0.6+E11*0.4)","v":"NA"}]
[]
[]
[]
[null,null,"Criterios Sustantivos de contenido 2015 -2017",{"$f":"COUNTA(F19:F28)","v":0}]
[]
[null,null,"Criterio",null,"Valoración","Tipo","Observaciones, Recomendaciones y/o Requerimientos"]
[null,null,"Criterio 1. Ejercicio",{"$f":"IF(E19=\"Justificado\",0,1)","v":1}]
[null,null,"Criterio 2. Ejercicio auditado",{"$f":"IF(E20=\"Justificado\",0,1)","v":1}]
[null,null,"Criterio 3. Hipervínculo a los estados financieros dictaminados",1]
[null,null,"Criterio 4. Fecha de emisión del dictamen día/mes/año (por ej. 27/Abril/2016)",1]
[null,null,"Criterio 5. Hipervínculo al dictamen de los estados financieros entregado por el contador público independiente al sujeto obligado en el que se incluyan los anexos con las observaciones, recomendaciones y notas. En su caso, se deberán prever documentos en versión pública si contienen información reservada",1]
[null,null,"Criterio 6. Total de observaciones resultantes",1]
[null,null,"Criterio 7. Total de aclaraciones efectuadas",1]
[null,null,"Criterio 8. Total de solventaciones",{"$f":"IF(E26=\"Justificado\",0,1)","v":1}]
[null,null,"Criterio 9. Razón social, denominación o nombre del (la) contador(a) público(a) independiente que realizó el dictamen",{"$f":"IF(E27=\"Justificado\",0,1)","v":1}]
[]
[]
[]
[]
[null,null,"Criterios Sustantivos de contenido \nLTG 2018 - LTG 2020 (DOF 28/12/20) ",{"$f":"COUNTA(F35:F57)","v":1}]
[]
[null,null,"Criterio",null,"Valoración","Tipo","Observaciones, Recomendaciones y/o Requerimientos"]
[null,null,"Criterio 1. Ejercicio",{"$f":"IF(E35=\"Justificado\",0,1)","v":1}]
[null,null,"Criterio 2. Periodo que se informa (fecha de inicio y fecha de término con el formato día/mes/año)",{"$f":"IF(E36=\"Justificado\",0,1)","v":1}]
[null,null,"Criterio 3. Ejercicio auditado",1]
[null,null,"Criterio 4. Hipervínculo a los estados financieros dictaminados",1]
[null,null,"Criterio 5. Fecha de emisión del dictamen, con el formato día/mes/año ",1]
[null,null,"Criterio 6. Hipervínculo al dictamen de los estados financieros entregado por el contador público independiente al sujeto obligado en el que se incluyan los anexos con las observaciones, recomendaciones y notas. En su caso, se deberán prever documentos en versión pública si contienen información reservada",1]
[null,null,"Criterio 7. Total de observaciones resultantes",1]
[null,null,"Criterio 8. Total de aclaraciones efectuadas",1]
[null,null,"Criterio 9. Total de solventaciones",{"$f":"IF(E43=\"Justificado\",0,1)","v":1}]
[null,null,"Criterio 10. Razón social, denominación o nombre del (la) contador(a) público(a) independiente que realizó el dictamen",{"$f":"IF(E44=\"Justificado\",0,1)","v":1}]
[]
[null,null,"Criterios Adjetivos LTG 2018 - LTG 2020 (DOF 28/12/20) "]
[]
[null,null,"Criterio",null,"Valoración","Tipo","Observaciones, Recomendaciones y/o Requerimientos"]
[null,null,"Criterio 11. Periodo de actualización de la información: anual; en su caso, 15 días hábiles después de que el Contador Público Independiente entregue una dictaminación especial",{"$f":"IF(E49=\"Justificado\",0,1)","v":1}]
[null,null,"Criterio12. La información pública deberá estar actualizada al periodo que corresponde de acuerdo con la Tabla de actualización y conservación de la información",1]
[null,null,"Criterio 13. Conservar en el sitio de Internet y a través de la Plataforma Nacional la información vigente de acuerdo con la Tabla de actualización y conservación de la información",1]
[null,null,"Criterio 14. Área(s) responsable(s) que genera(n), posee(n), publica(n) y/o actualiza(n) la información ",1]
[null,null,"Criterio 15. Fecha de actualización de la información con el formato día/mes/año",1]
[null,null,"Criterio 16. Fecha de validación de la información con el formato día/mes/año",1]
[null,null,"Criterio 17. Nota. Este criterio se cumple en caso de que sea necesario que el sujeto obligado incluya alguna aclaración relativa a la información publicada y/o explicación por la falta de información ",1]
[null,null,"Criterio 18. La información publicada se organiza mediante el formato 25, en el que se incluyen todos los campos especificados en los criterios sustantivos de contenido",1]
[null,null,"Criterio 19. El soporte de la información permite su reutilización",1]
{"$rows_empty":7}
[{"$nulls":3},2017,2018]
[null,null,"CS",{"$f":"IF(Aplicabilidad!G36<>\"SI\",\"NA\",SUM(E19:E27)/SUM(D19:D27))","v":"NA"},{"$f":"IF(Aplicabilidad!G36<>\"SI\",\"NA\",SUM(E35:E44)/SUM(D35:D44))","v":"NA"}]
[null,null,"CA",{"$f":"IF(Aplicabilidad!G36<>\"SI\",\"NA\",SUM(#REF!)/SUM(#REF!))","v":"NA"},{"$f":"IF(Aplicabilidad!G36<>\"SI\",\"NA\",SUM(E49:E57)/SUM(D49:D57))","v":"NA"}]
[null,null,"OBLIGACIÓN",{"$f":"IF(Aplicabilidad!G36<>\"SI\",\"NA\",D66*0.6+D67*0.4)","v":"NA"},{"$f":"IF(Aplicabilidad!G36<>\"SI\",\"NA\",E66*0.6+E67*0.4)","v":"NA"}]

{"sheet":"Art 74_XXVI","index":28,"n_rows":87,"n_cols":7,"rows_kept":87,"hidden":true,"merged":[[0,2,0,6],[4,1,4,7],[14,4,14,6],[38,4,38,6]]}
[null,null,{"$f":"IF(Aplicabilidad!E2=\"\",\"\",Aplicabilidad!E2)","v":"Consejería Jurídica"}]
[]
[null,"Códigos de valoración : Cumplió totalmente = 1; Cumplió parcialmente = 0.5; No cumplió = 0; Justificado = Justificado"]
[]
[null,"Art. 74 - Fracción XXVI. Personas físicas o morales a quienes se asigne recursos públicos"]
[]
[null,null,"Fecha de Inicio de la Verificación:",{"$nulls":3},"Fecha de Término de la verificación"]
[null,null,{"$f":"IF(Resultados!$C$7=\"\",\"\",Resultados!$C$7)","v":"2021-07-07"},"2018-05-25",null,null,{"$f":"IF(Resultados!G7=\"\",\"\",Resultados!G7)","v":"2021-07-08"}]
[]
[null,null,"Criterios Sustantivos",null,{"$f":"IF(Aplicabilidad!G37<>\"SI\",\"NA\",(SUM(E19:E35)+SUM(E43:E63))/(SUM(D19:D35)+SUM(D43:D63)))","v":"NA"}]
[null,null,"Criterios Adjetivos",null,{"$f":"IF(Aplicabilidad!G37<>\"SI\",\"NA\",(SUM(E68:E76))/(SUM(D68:D76)))","v":"NA"}]
[null,null,"Obligación",null,{"$f":"IF(Aplicabilidad!G37<>\"SI\",\"NA\",E10*0.6+E11*0.4)","v":"NA"}]
[]
[]
[]
[null,null,"Criterios Sustantivos de contenido \nLTG 2018 - LTG 2020 (DOF 28/12/20) ",{"$f":"COUNTA(F19:F36)","v":0}]
[]
[null,null,"Criterio",null,"Valoración","Tipo","Observaciones, Recomendaciones y/o Requerimientos"]
[null,null,"Criterio 1. Ejercicio",{"$f":"IF(E19=\"Justificado\",0,1)","v":0},"Justificado"]
[null,null,"Criterio 2. Periodo que se informa",{"$f":"IF(E20=\"Justificado\",0,1)","v":0},"Justificado"]
[null,null,"Criterio 3. Ámbito de aplicación, función o destino del recurso público: Educación / Salud / Cultura / Desarrollo social / Economía /Protección del medio ambiente / Otro (especificar)",0,"Justificado"]
[null,null,"Criterio 4. Fecha en la que el sujeto obligado firmó el documento que autoriza la asignación o permite la entrega de recursos al/los particulares, publicada con el formato día/mes/año (por ej. 31/Marzo/2016)",0,"Justificado"]
[null,null,"Criterio 5. Hipervínculo al convenio, acuerdo, decreto o convocatoria oficial. En su caso, señalar que no se emitió convocatoria alguna. Cuando se trate de sindicatos, se publicará un hipervínculo al convenio o acuerdo concertado con la representación sindical",0,"Justificado"]
[null,null,"Criterio 6. Denominación, en su caso, de la partida presupuestal que dio origen a los recursos que se entregaron",0,"Justificado"]
[null,null,"Criterio 7. Total de presupuesto otorgado a la partida presupuestal antes mencionada, en su caso",0,"Justificado"]
[null,null,"Criterio 8. Unidad administrativa responsable del otorgamiento (de acuerdo con el catálogo de unidades administrativas o puestos del sujeto obligado, si así corresponde)",0,"Justificado"]
[null,null,"Criterio 9. Fundamento jurídico (artículo, fracción, lineamiento, o lo que corresponda) que sustenta la asignación o permiso para usar recursos públicos",0,"Justificado"]
[null,null,"Criterio 10. Personería jurídica: Persona física / Persona moral",0,"Justificado"]
[null,null,"Criterio 11. Clasificación de la persona moral: Sociedad mercantil / Sociedad / Asociación civil / Sociedad cooperativa de producción / Institución de crédito / Institución de seguros y fianzas / Almacén general de depósito / Arrendadora financiera / Unión de crédito y sociedad de inversión de capitales / Organismo descentralizado que comercializa bienes o servicios / Fideicomiso con actividades empresariales / Institución de asistencia o de beneficencia / Asociación deportiva / Asociación religiosa / Donataria autorizada / Asociación patronal / Sindicato / Cámara de comercio e industria / Asociación o sociedad civil de enseñanza de investigación científica o tecnológica / Sociedad cooperativa de consumo / Institución o sociedad civil que administren fondos o cajas de ahorro / Asociaciones de padres de familia / Asociación civil de colonos o que administren inmuebles en condominio / Agrupación agrícola / Agrupación ganadera / Agrupación pesquera / Agrupación silvícola / Asociación civil y sociedad de responsabilidad limitada / Asociación o sociedad civil autorizada para recibir donativos / Sociedad de gestión colectiva constituida conforme a la Ley Federal de Derecho de Autor / Asociación o sociedad civil que otorgue becas conforme al artículo 83 Ley del Impuesto Sobre la Renta / Sociedad y asociación civil dedicada a la investigación o preservación de la flora o fauna silvestre, reproducción de especies en peligro de extinción y conservación de su hábitat / Partido político / Asociación política legalmente reconocida",0,"Justificado"]
[null,null,"Criterio 12. Nombre completo (nombre[s], primer apellido y segundo apellido) del beneficiario (persona física) o denominación y/o razón social (persona moral, organización civil o sindicato) de la persona que recibió los recursos",0,"Justificado"]
[null,null,"Criterio 13. Monto total y/o recurso público que se permitió o permitirá usar",0,"Justificado"]
[null,null,"Criterio 14. Monto por entregarse y/o recurso público que se permitirá usar",0,"Justificado"]
[null,null,"Criterio 15. Periodicidad de entrega de recursos (mensual, trimestral, anual, etcétera, o especificar si fue única)",0,"Justificado"]
[null,null,"Criterio 16. Fecha en la que se entregó o entregarán los recursos (por ej. 31/Marzo/2016)",{"$f":"IF(E34=\"Justificado\",0,1)","v":0},"Justificado"]
[null,null,"Criterio 17. Hipervínculo a los informes sobre el uso y destino de los recursos que se asignaron o cuyo uso se permitió",{"$f":"IF(E35=\"Justificado\",0,1)","v":0},"Justificado"]
[]
[]
[]
[]
[null,null,"Criterios Sustantivos de contenido LTG 2018 - LTG 2020 (DOF 28/12/20) ",{"$f":"COUNTA(F43:F76)","v":1}]
[]
[null,null,"Criterio",null,"Valoración","Tipo","Observaciones, Recomendaciones y/o Requerimientos"]
[null,null,"Criterio 1. Ejercicio",{"$f":"IF(E43=\"Justificado\",0,1)","v":1}]
[null,null,"Criterio 2. Periodo que se informa (fecha de inicio y fecha de término con el formato día/mes/año)",{"$f":"IF(E44=\"Justificado\",0,1)","v":1}]
[null,null,"Criterio 3. Nombre completo (nombre[s], primer apellido y segundo apellido) o  razón social de la persona que recibió los recursos del beneficiario (persona física)",1]
[null,null,"Criterio 4. Personería jurídica (catálogo): Persona física / Persona moral",1]
[null,null,"Criterio 5. Clasificación de la persona moral. Por ejemplo: Sociedad civil/ sociedad mercantil/ Asociación civil/ asociación deportiva",1]
[null,null,"Criterio 6. Tipo de acción que realiza la persona física o moral (catálogo): Recibe recursos públicos/Realiza actos de autoridad ",1]
[null,null,"Criterio 7. Ámbito de aplicación, función o destino del recurso público (catálogo): Educación/ Salud / Cultura/ Desarrollo social/  Economía/ Protección del medio ambiente/ Obligaciones laborales / Agricultura/Otro (especificar)",1]
[null,null,"Criterio 8. Fundamento jurídico (artículo, fracción, lineamiento, o lo que corresponda) que sustenta la asignación o permiso para usar recursos públicos",1]
[null,null,"Criterio 9. Tipo de recurso público. Por ejemplo: en dinero, especie u otro(especificar)",1]
[null,null,"Criterio 10. Monto total y/o recurso público entregado en el ejercicio fiscal",1]
[null,null,"Criterio 11. Monto por entregarse y/o recurso público que se permitió usar, en su caso",1]
[null,null,"Criterio 12. Periodicidad de entrega de recursos. Por ejemplo: mensual, trimestral, anual, etcétera, o especificar si fue única",1]
[null,null,"Criterio 13. Modalidad de entrega del recurso o, en su caso, del otorgamiento de facultades para realizar. Por ejemplo: Recursos públicos: asignación, aportación, aprovechamiento, financiamiento, mejora etcétera. Respecto de Actos de autoridad: permiso, concesión, nombramiento, entre otros",1]
[null,null,"Criterio 14. Fecha en la que se entregaron o se entregarán los recursos, con el formato día/mes/año",1]
[null,null,"Criterio 15. Hipervínculo a los informes sobre el uso y destino de los recursos que se asignaron o cuyo uso se permitió",1]
[null,null,"Criterio 16. Fecha en la que el sujeto obligado firmó el documento que autoriza la asignación o permite la entrega de recursos al/los particulares, publicada con el formato día/mes/año",1]
[null,null,"Criterio 17. Hipervínculo al convenio, acuerdo, decreto o convocatoria oficial. En su caso, señalar que no se emitió convocatoria alguna",1]
[null,null,"Criterio 18    . Acto(s) de autoridad para los que se facultó a la persona física o moral",1]
[null,null,"Criterio 19 . Periodo para el que fue facultado para realizar el/los acto(s) de autoridad (fecha de inicio y fecha de término día/mes/año)",1]
[null,null,"Criterio 20. El gobierno participó en la creación de la persona física o moral (catálogo): si/no",{"$f":"IF(E62=\"Justificado\",0,1)","v":1}]
[null,null,"Criterio 21. La persona física o moral realiza una función gubernamental (catálogo): si/no",{"$f":"IF(E63=\"Justificado\",0,1)","v":1}]
[]
[null,null,"Criterios Adjetivos LTG 2018 - LTG 2020 (DOF 28/12/20) "]
[]
[null,null,"Criterio",null,"Valoración","Tipo","Observaciones, Recomendaciones y/o Requerimientos"]
[null,null,"Criterio 22. Periodo de actualización de la información: trimestral",{"$f":"IF(E68=\"Justificado\",0,1)","v":1}]
[null,null,"Criterio 23. La información deberá estar actualizada al periodo que corresponde de acuerdo con la Tabla de actualización y conservación de la información",1]
[null,null,"Criterio 24. Conservar en el sitio de Internet y a través de la Plataforma Nacional la información vigente de acuerdo con la Tabla de actualización y conservación de la información",1]
[null,null,"Criterio 25. Área(s) responsable(s) que genera(n), posee(n), publica(n) y/o actualiza(n) la información  ",1]
[null,null,"Criterio 26. Fecha de actualización de la información publicada con el formato día/mes/año",1]
[null,null,"Criterio 27. Fecha de validación de la información publicada con el formato día/mes/año",1]
[null,null,"Criterio 28. Nota. Este criterio se cumple en caso de que sea necesario que el sujeto obligado incluya alguna aclaración relativa a la información publicada y/o explicación por la falta de información",1]
[null,null,"Criterio 29. La información publicada se organiza mediante el formato 26, en el que se incluyen todos los campos especificados en los criterios sustantivos de contenido",1]
[null,null,"Criterio 30. El soporte de la información permite su reutilización",1]
{"$rows_empty":7}
[{"$nulls":3},2017,2018]
[null,null,"CS",{"$f":"IF(Aplicabilidad!G37<>\"SI\",\"NA\",SUM(E19:E35)/SUM(D19:D35))","v":"NA"},{"$f":"IF(Aplicabilidad!G37<>\"SI\",\"NA\",SUM(E43:E63)/SUM(D43:D63))","v":"NA"}]
[null,null,"CA",{"$f":"IF(Aplicabilidad!G37<>\"SI\",\"NA\",SUM(#REF!)/SUM(#REF!))","v":"NA"},{"$f":"IF(Aplicabilidad!G37<>\"SI\",\"NA\",SUM(E68:E76)/SUM(D68:D76))","v":"NA"}]
[null,null,"OBLIGACIÓN",{"$f":"IF(Aplicabilidad!G37<>\"SI\",\"NA\",D85*0.6+D86*0.4)","v":"NA"},{"$f":"IF(Aplicabilidad!G37<>\"SI\",\"NA\",E85*0.6+E86*0.4)","v":"NA"}]

{"sheet":"Art 74_XXVII","index":29,"n_rows":86,"n_cols":7,"rows_kept":86,"hidden":true,"merged":[[0,2,0,6],[4,1,4,7],[14,4,14,6],[38,4,38,6]]}
[null,null,{"$f":"IF(Aplicabilidad!E2=\"\",\"\",Aplicabilidad!E2)","v":"Consejería Jurídica"}]
[]
[null,"Códigos de valoración : Cumplió totalmente = 1; Cumplió parcialmente = 0.5; No cumplió = 0; Justificado = Justificado"]
[]
[null,"Art. 74 - Fracción XXVII. Concesiones, contratos, convenios, permisos, licencias o autorizaciones otorgados"]
[]
[null,null,"Fecha de Inicio de la Verificación:",{"$nulls":3},"Fecha de Término de la verificación"]
[null,null,{"$f":"IF(Resultados!$C$7=\"\",\"\",Resultados!$C$7)","v":"2021-07-07"},"2018-05-25",null,null,{"$f":"IF(Resultados!G7=\"\",\"\",Resultados!G7)","v":"2021-07-08"}]
[]
[null,null,"Criterios Sustantivos",null,{"$f":"IF(Aplicabilidad!G38<>\"SI\",\"NA\",(SUM(E19:E35)+SUM(E43:E62))/(SUM(D19:D35)+SUM(D43:D62)))","v":"NA"}]
[null,null,"Criterios Adjetivos",null,{"$f":"IF(Aplicabilidad!G38<>\"SI\",\"NA\",(SUM(E67:E75))/(SUM(D67:D75)))","v":"NA"}]
[null,null,"Obligación",null,{"$f":"IF(Aplicabilidad!G38<>\"SI\",\"NA\",E10*0.6+E11*0.4)","v":"NA"}]
[]
[]
[]
[null,null,"Criterios Sustantivos de contenido \nLTG 2018 - LTG 2020 (DOF 28/12/20) ",{"$f":"COUNTA(F19:F36)","v":0}]
[]
[null,null,"Criterio",null,"Valoración","Tipo","Observaciones, Recomendaciones y/o Requerimientos"]
[null,null,"Criterio 1. Ejercicio",{"$f":"IF(E19=\"Justificado\",0,1)","v":0},"Justificado"]
[null,null,"Criterio 2. Periodo que se informa",{"$f":"IF(E20=\"Justificado\",0,1)","v":0},"Justificado"]
[null,null,"Criterio 3. Tipo de acto jurídico: Concesión / Contrato / Convenio / Permiso / Licencia / Autorización",0,"Justificado"]
[null,null,"Criterio 4. Objeto (la finalidad con la que se realizó el acto jurídico)",0,"Justificado"]
[null,null,"Criterio 5. Fundamento jurídico por el cual se llevó a cabo el acto jurídico",0,"Justificado"]
[null,null,"Criterio 6. Unidad(es) responsable(s) de instrumentación",0,"Justificado"]
[null,null,"Criterio 7. Sector al cual se otorgó el acto jurídico: Público / Privado",0,"Justificado"]
[null,null,"Criterio 8. Nombre completo (nombre[s], primer apellido y segundo apellido) o razón social del titular al cual se otorgó el acto jurídico",0,"Justificado"]
[null,null,"Criterio 9. Fecha de inicio de vigencia del acto jurídico expresado en el formato día/mes/año (por ej. 31/marzo/2016)",0,"Justificado"]
[null,null,"Criterio 10. Fecha de término de vigencia del acto jurídico expresado en el formato día/mes/año (por ej. 31/marzo/2016)",0,"Justificado"]
[null,null,"Criterio 11. Cláusula, punto, artículo o fracción en el que se especifican los términos y condiciones del acto jurídico",0,"Justificado"]
[null,null,"Criterio 12. Hipervínculo al contrato, convenio, permiso, licencia o concesión, donde se especifiquen los términos y condiciones, incluidos los anexos, en versión pública cuando así corresponda",0,"Justificado"]
[null,null,"Criterio 13. Monto total o beneficio, servicio y/o recurso público aprovechado",0,"Justificado"]
[null,null,"Criterio 14. Monto entregado, bien, servicio y/o recurso público aprovechado al periodo que se informa",0,"Justificado"]
[null,null,"Criterio 15. Hipervínculo al documento donde se desglose el gasto a precios del año tanto para el ejercicio fiscal correspondiente como para los subsecuentes",0,"Justificado"]
[null,null,"Criterio 16. Hipervínculo al informe sobre el monto total erogado, que en su caso corresponda",{"$f":"IF(E34=\"Justificado\",0,1)","v":0},"Justificado"]
[null,null,"Criterio 17. Hipervínculo al contrato plurianual modificado, en su caso",{"$f":"IF(E35=\"Justificado\",0,1)","v":0},"Justificado"]
[]
[]
[]
[]
[null,null,"Criterios Sustantivos de contenido\nLTG 2018 - LTG 2020 (DOF 28/12/20) ",{"$f":"COUNTA(F43:F75)","v":1}]
[]
[null,null,"Criterio",null,"Valoración","Tipo","Observaciones, Recomendaciones y/o Requerimientos"]
[null,null,"Criterio 1. Ejercicio",{"$f":"IF(E43=\"Justificado\",0,1)","v":1}]
[null,null,"Criterio 2. Periodo que se informa (fecha de inicio y fecha de término con el formato día/mes/año)",{"$f":"IF(E44=\"Justificado\",0,1)","v":1}]
[null,null,"Criterio 3. Tipo de acto jurídico (catálogo): Concesión/Contrato/Convenio/Permiso/Licencia/Autorización/Asignación",1]
[null,null,"Criterio 4. Número de control interno asignado, en su caso, al contrato, convenio, concesión, permiso, licencia, autorización o asignación",1]
[null,null,"Criterio 5. Objeto (la finalidad con la que se realizó el acto jurídico)",1]
[null,null,"Criterio 6. Fundamento jurídico por el cual se llevó a cabo el acto jurídico",1]
[null,null,"Criterio 7. Unidad(es) o área(s) responsable(s) de instrumentación",1]
[null,null,"Criterio 8. Sector al cual se otorgó el acto jurídico (catálogo): Público/Privado",1]
[null,null,"Criterio 9. Nombre completo (nombre[s], primer apellido y segundo apellido) o razón social del titular al cual se otorgó el acto jurídico",1]
[null,null,"Criterio 10. Fecha de inicio de vigencia del acto jurídico con en el formato día/mes/año ",1]
[null,null,"Criterio 11. Fecha de término de vigencia del acto jurídico con en el formato día/mes/año ",1]
[null,null,"Criterio 12. Cláusula, punto, artículo o fracción en el que se especifican los términos y condiciones del acto jurídico",1]
[null,null,"Criterio 13. Hipervínculo al contrato, convenio, permiso, licencia o concesión, donde se especifiquen los términos y condiciones, incluidos los anexos, en versión pública cuando así corresponda",1]
[null,null,"Criterio 14. Monto total o beneficio, servicio y/o recurso público aprovechado",1]
[null,null,"Criterio 15. Monto entregado, bien, servicio y/o recurso público aprovechado al periodo que se informa",1]
[null,null,"Criterio 16. Hipervínculo al documento donde se desglose el gasto a precios del año tanto para el ejercicio fiscal correspondiente como para los subsecuentes",1]
[null,null,"Criterio 17. Hipervínculo al informe sobre el monto total erogado, que en su caso corresponda",1]
[null,null,"Criterio 18. Hipervínculo al contrato plurianual modificado, en su caso",1]
[null,null,"Criterio 19. Se realizaron convenios modificatorios (catálogo): Sí/No",{"$f":"IF(E61=\"Justificado\",0,1)","v":1}]
[null,null,"Criterio 20. Hipervínculo al convenio modificatorio, si así corresponde",{"$f":"IF(E62=\"Justificado\",0,1)","v":1}]
[]
[null,null,"Criterios Adjetivos LTG 2018 - LTG 2020 (DOF 28/12/20) "]
[]
[null,null,"Criterio",null,"Valoración","Tipo","Observaciones, Recomendaciones y/o Requerimientos"]
[null,null,"Criterio 21. Periodo de actualización de la información: trimestral",{"$f":"IF(E67=\"Justificado\",0,1)","v":1}]
[null,null,"Criterio 22. La información deberá estar actualizada al periodo que corresponde de acuerdo con la Tabla de actualización y conservación de la información",1]
[null,null,"Criterio 23. Conservar en el sitio de Internet: información del ejercicio en curso y la correspondiente a dos ejercicios anteriores",1]
[null,null,"Criterio 24. Área(s) responsable(s) que genera(n), posee(n), publica(n) y/o actualiza(n) la información ",1]
[null,null,"Criterio 25. Fecha de actualización de la información publicada con el formato día/mes/año",1]
[null,null,"Criterio 26. Fecha de validación de la información publicada con el formato día/mes/año ",1]
[null,null,"Criterio 27. Nota. Este criterio se cumple en caso de que sea necesario que el sujeto obligado incluya alguna aclaración relativa a la información publicada y/o explicación por la falta de información ",1]
[null,null,"Criterio 28. La información publicada se organiza mediante el formato 27, en el que se incluyen todos los campos especificados en los criterios sustantivos de contenido",1]
[null,null,"Criterio 29. El soporte de la información permite su reutilización",1]
{"$rows_empty":7}
[{"$nulls":3},2017,2018]
[null,null,"CS",{"$f":"IF(Aplicabilidad!G38<>\"SI\",\"NA\",SUM(E19:E35)/SUM(D19:D35))","v":"NA"},{"$f":"IF(Aplicabilidad!G38<>\"SI\",\"NA\",SUM(E43:E62)/SUM(D43:D62))","v":"NA"}]
[null,null,"CA",{"$f":"IF(Aplicabilidad!G38<>\"SI\",\"NA\",SUM(#REF!)/SUM(#REF!))","v":"NA"},{"$f":"IF(Aplicabilidad!G38<>\"SI\",\"NA\",SUM(E67:E75)/SUM(D67:D75))","v":"NA"}]
[null,null,"OBLIGACIÓN",{"$f":"IF(Aplicabilidad!G38<>\"SI\",\"NA\",D84*0.6+D85*0.4)","v":"NA"},{"$f":"IF(Aplicabilidad!G38<>\"SI\",\"NA\",E84*0.6+E85*0.4)","v":"NA"}]

{"sheet":"Art 74_XXVIII","index":30,"n_rows":258,"n_cols":7,"rows_kept":258,"hidden":true,"merged":[[0,2,0,6],[4,1,4,7],[14,4,14,6],[114,4,114,6]]}
[null,null,{"$f":"IF(Aplicabilidad!E2=\"\",\"\",Aplicabilidad!E2)","v":"Consejería Jurídica"}]
[]
[null,"Códigos de valoración : Cumplió totalmente = 1; Cumplió parcialmente = 0.5; No cumplió = 0; Justificado = Justificado"]
[]
[null,"Art. 74 - Fracción XXVIII. Procedimientos de adjudicación directa, invitación restringida y licitaciones"]
[]
[null,null,"Fecha de Inicio de la Verificación:",{"$nulls":3},"Fecha de Término de la verificación"]
[null,null,{"$f":"IF(Resultados!$C$7=\"\",\"\",Resultados!$C$7)","v":"2021-07-07"},"2018-05-25",null,null,{"$f":"IF(Resultados!G7=\"\",\"\",Resultados!G7)","v":"2021-07-08"}]
[]
[null,null,"Criterios Sustantivos",null,{"$f":"IF(Aplicabilidad!G39<>\"SI\",\"NA\",(SUM(E19:E111)+SUM(E119:E234))/(SUM(D19:D111)+SUM(D119:D234)))","v":"NA"}]
[null,null,"Criterios Adjetivos",null,{"$f":"IF(Aplicabilidad!G39<>\"SI\",\"NA\",(SUM(E239:E247))/(SUM(D239:D247)))","v":"NA"}]
[null,null,"Obligación",null,{"$f":"IF(Aplicabilidad!G39<>\"SI\",\"NA\",E10*0.6+E11*0.4)","v":"NA"}]
[]
[]
[]
[null,null,"Criterios Sustantivos de contenido \nLTG 2018 - LTG 2020 (DOF 28/12/20) ",{"$f":"COUNTA(F19:F112)","v":0}]
[]
[null,null,"Criterio",null,"Valoración","Tipo","Observaciones, Recomendaciones y/o Requerimientos"]
[null,null,"Criterio 1. Tipo de procedimiento: Licitación pública / Invitación a cuando menos tres personas / Adjudicación directa / Otra (especificar)",{"$f":"IF(E19=\"Justificado\",0,1)","v":0},"Justificado"]
[null,null,"Criterio 2. Materia: Obra pública / Servicios relacionados con obra pública / Adquisiciones / Arrendamientos / Servicios",{"$f":"IF(E20=\"Justificado\",0,1)","v":0},"Justificado"]
[null,null,"Criterio 3. Ejercicio",0,"Justificado"]
[null,null,"Criterio 4. Periodo que se reporta",0,"Justificado"]
[null,null,"Criterio 5. Número de expediente, folio o nomenclatura que identifique a cada procedimiento",0,"Justificado"]
[null,null,"Criterio 6. Hipervínculo a la convocatoria o invitaciones emitidas",0,"Justificado"]
[null,null,"Criterio 7. Fecha de la convocatoria o invitación, expresada con el formato día/mes/año (por ej. 31/Marzo/2016)",0,"Justificado"]
[null,null,"Criterio 8. Descripción de las obras públicas, los bienes o los servicios contratados",0,"Justificado"]
[null,null,"Criterio 9. Relación con los nombres de las personas físicas o morales que presentaron una proposición u oferta (en el caso de personas físicas: nombre[s], primer apellido, segundo apellido, en el caso de persona moral, razón social)",0,"Justificado"]
[null,null,"Criterio 10. Fecha en la que se celebró la junta de aclaraciones, expresada con el formato día/mes/año (por ej. 31/Marzo/2016)",0,"Justificado"]
[null,null,"Criterio 11. Relación con los nombres de los asistentes a la junta de aclaraciones (nombre[s], apellido paterno, apellido materno). En el caso de personas morales especificar su denominación o razón social",0,"Justificado"]
[null,null,"Criterio 12. Relación con los nombres de los servidores públicos asistentes a la junta de aclaraciones (nombre[s], apellido paterno, apellido materno)",0,"Justificado"]
[null,null,"Criterio 13. Incluir el cargo que ocupan en el sujeto obligado los servidores públicos asistentes a la junta de aclaraciones",0,"Justificado"]
[null,null,"Criterio 14. Hipervínculo al fallo de la de aclaraciones o al documento correspondiente",0,"Justificado"]
[null,null,"Criterio 15. Hipervínculo, en su caso, al (los) dictamen(es)",0,"Justificado"]
[null,null,"Criterio 16. Nombre completo o razón social del contratista o proveedor (en el caso de personas físicas: nombre[s], primer, apellido, segundo apellido)",0,"Justificado"]
[null,null,"Criterio 17. Descripción breve de las razones que justifican su elección",0,"Justificado"]
[null,null,"Criterio 18. Unidad administrativa solicitante de las obras públicas, el arrendamiento, la adquisición de bienes y/o la prestación de servicios",0,"Justificado"]
[null,null,"Criterio 19. Unidad administrativa contratante",0,"Justificado"]
[null,null,"Criterio 20. Unidad administrativa responsable de la ejecución",0,"Justificado"]
[null,null,"Criterio 21. Número que identifique al contrato",0,"Justificado"]
[null,null,"Criterio 22. Fecha del contrato, expresada con el formato día/mes/año (por ej. 31/Marzo/2016)",0,"Justificado"]
[null,null,"Criterio 23. Monto del contrato sin impuestos incluidos (expresados en pesos mexicanos)",0,"Justificado"]
[null,null,"Criterio 24. Monto total del contrato con impuestos incluidos (expresados en pesos mexicanos)",0,"Justificado"]
[null,null,"Criterio 25. Monto mínimo, y máximo, en su caso",0,"Justificado"]
[null,null,"Criterio 26. Tipo de moneda",0,"Justificado"]
[null,null,"Criterio 27. Tipo de cambio de referencia, en su caso",0,"Justificado"]
[null,null,"Criterio 28. Forma de pago (efectivo, cheque o transacción bancaria)",0,"Justificado"]
[null,null,"Criterio 29. Objeto del contrato",0,"Justificado"]
[null,null,"Criterio 30. Fecha de inicio expresada con el formato día/mes/año (por ej. 31/Marzo/2016)",0,"Justificado"]
[null,null,"Criterio 31. Fecha de término expresada con el formato día/mes/año (por ej. 31/Marzo/2016)",0,"Justificado"]
[null,null,"Criterio 32. Hipervínculo al documento del contrato y sus anexos, en versión pública si así corresponde",0,"Justificado"]
[null,null,"Criterio 33. Hipervínculo, en su caso al comunicado de suspensión, rescisión o terminación anticipada del contrato",0,"Justificado"]
[null,null,"Criterio 34. Partida presupuestal (catálogo) de acuerdo con el Clasificador por Objeto del Gasto en el caso de ser aplicable",0,"Justificado"]
[null,null,"Criterio 35. Origen de los recursos públicos: Federales / Estatales / Municipales",0,"Justificado"]
[null,null,"Criterio 36. Fuente de financiamiento: Recursos Fiscales / Financiamientos internos / Financiamientos externos / Ingresos propios / Recursos Federales / Recursos Estatales/ Otros recursos (especificar)",0,"Justificado"]
[null,null,"Criterio 37. Tipo de fondo de participación o aportación respectiva",0,"Justificado"]
[null,null,"Criterio 38. Lugar donde se realizará la obra pública y/o servicio relacionado con la misma",0,"Justificado"]
[null,null,"Criterio 39. Breve descripción de la obra pública",0,"Justificado"]
[null,null,"Criterio 40. Hipervínculo a los estudios de impacto urbano y ambiental. En su caso, señalar que no se realizaron",0,"Justificado"]
[null,null,"Criterio 41. Incluir, en su caso, observaciones dirigidas a la población relativas a la realización de las obras públicas, tales como: cierre de calles, cambio de circulación, impedimentos de paso, etcétera",0,"Justificado"]
[null,null,"Criterio 42. Etapa de la obra pública y/o servicio de la misma: en planeación, en ejecución; o en finiquito.",0,"Justificado"]
[null,null,"Criterio 43. Se realizaron convenios modificatorios: Sí/ No",0,"Justificado"]
[null,null,"Criterio 44. Número de convenio modificatorio que recaiga a la contratación; en su caso, señalar que no se realizó",0,"Justificado"]
[null,null,"Criterio 45. Objeto del convenio modificatorio",0,"Justificado"]
[null,null,"Criterio 46. Fecha de firma del convenio modificatorio, expresada con el formato día/mes/año (por ej. 31/Marzo/2016)",0,"Justificado"]
[null,null,"Criterio 47. Hipervínculo al documento del convenio, en versión pública si así corresponde",0,"Justificado"]
[null,null,"Criterio 48. Mecanismos de vigilancia y supervisión de la ejecución, especificados en los contratos y/o convenios",0,"Justificado"]
[null,null,"Criterio 49. Hipervínculo, en su caso, al (los) informe(s) de avance físicos en versión pública si así corresponde",0,"Justificado"]
[null,null,"Criterio 50. Hipervínculo, en su caso, al (los) informe(s) de avance financieros, en versión pública si así corresponde",0,"Justificado"]
[null,null,"Criterio 51. Hipervínculo al acta de recepción física de los trabajos ejecutados u homóloga",0,"Justificado"]
[null,null,"Criterio 52. Hipervínculo al finiquito",0,"Justificado"]
[null,null,"Criterio 53. Ejercicio",0,"Justificado"]
[null,null,"Criterio 54. Periodo que se reporta",0,"Justificado"]
[null,null,"Criterio 55. Número de expediente, folio o nomenclatura que lo identifique",0,"Justificado"]
[null,null,"Criterio 56. Los motivos y fundamentos legales aplicados para realizar la adjudicación directa",0,"Justificado"]
[null,null,"Criterio 57. Hipervínculo a la autorización del ejercicio de la opción",0,"Justificado"]
[null,null,"Criterio 58. Descripción de las obras, los bienes o servicios contratados y/o adquiridos",0,"Justificado"]
[null,null,"Criterio 59. Nombre completo o razón social de los posibles contratantes (personas físicas: nombre[s], primer apellido, segundo apellido). En su caso, incluir una leyenda señalando que no se realizaron cotizaciones",0,"Justificado"]
[null,null,"Criterio 60. Monto total de la cotización con impuestos incluidos",0,"Justificado"]
[null,null,"Criterio 61. Nombre o razón social del adjudicado (en el caso de personas físicas: nombre[s], primer apellido, segundo apellido)",0,"Justificado"]
[null,null,"Criterio 62. Unidad administrativa solicitante",0,"Justificado"]
[null,null,"Criterio 63. Unidad administrativa responsable de la ejecución del contrato",0,"Justificado"]
[null,null,"Criterio 64. Número que identifique al contrato",0,"Justificado"]
[null,null,"Criterio 65. Fecha del contrato, expresada con el formato día/mes/año (por ej. 31/Marzo/2016)",0,"Justificado"]
[null,null,"Criterio 66. Monto del contrato sin impuestos incluidos (expresados en pesos mexicanos)",{"$f":"IF(E84=\"Justificado\",0,1)","v":0},"Justificado"]
[null,null,"Criterio 67. Monto total del contrato con impuestos incluidos (expresado en pesos mexicanos)",0,"Justificado"]
[null,null,"Criterio 68. Monto mínimo, y máximo, en su caso",0,"Justificado"]
[null,null,"Criterio 69. Tipo de moneda",0,"Justificado"]
[null,null,"Criterio 70. Tipo de cambio de referencia, en su caso",0,"Justificado"]
[null,null,"Criterio 71. Forma de pago (efectivo, cheque o transacción bancaria)",0,"Justificado"]
[null,null,"Criterio 72. Objeto del contrato",0,"Justificado"]
[null,null,"Criterio 73. Monto total de las garantías y/o contragarantías que, en su caso, se hubieren otorgado durante el procedimiento respectivo",0,"Justificado"]
[null,null,"Criterio 74. Fecha de inicio expresada con el formato día/mes/año (por ej. 31/Marzo/2016)",0,"Justificado"]
[null,null,"Criterio 75. Fecha de término expresada con el formato día/mes/año (por ej. 31/Marzo/2016)",0,"Justificado"]
[null,null,"Criterio 76. Hipervínculo al documento del contrato y sus anexos, en versión pública si así corresponde",0,"Justificado"]
[null,null,"Criterio 77. Hipervínculo, en su caso al comunicado de suspensión, rescisión o terminación anticipada del contrato",0,"Justificado"]
[null,null,"Criterio 78. Origen de los recursos públicos: Federales / Estatales Delegacionales / Municipales",0,"Justificado"]
[null,null,"Criterio 79. Fuentes de financiamiento: Recursos Fiscales / Financiamientos internos / Financiamientos externos / Ingresos propios / Recursos Federales / Recursos Estatales[6]/ Otros recursos (especificar) / Otros recursos (especificar)",0,"Justificado"]
[null,null,"Criterio 80. Lugar donde se realizará la obra pública y/o servicio relacionado con la misma",0,"Justificado"]
[null,null,"Criterio 81. Hipervínculo a los estudios de impacto urbano y ambiental. En su caso, señalar que no se realizaron",0,"Justificado"]
[null,null,"Criterio 82. Incluir, en su caso, observaciones dirigidas a la población relativas a la realización de las obras públicas, tales como: cierre de calles, cambio de circulación, impedimentos de paso, etcétera",0,"Justificado"]
[null,null,"Criterio 83. Etapa de la obra pública y/o servicio de la misma: en planeación, en ejecución; o en finiquito",0,"Justificado"]
[null,null,"Criterio 84. Se realizaron convenios modificatorios: Sí / No",0,"Justificado"]
[null,null,"Criterio 85. Número que le corresponde al(los) convenio(s) modificatorio(s) que recaiga(n) a la contratación",0,"Justificado"]
[null,null,"Criterio 86. Objeto del convenio",0,"Justificado"]
[null,null,"Criterio 87. Fecha de firma del convenio, expresada con el formato día/mes/año (por ej. 31/Marzo/2016)",0,"Justificado"]
[null,null,"Criterio 88. Hipervínculo al documento del convenio, en versión pública si así corresponde",0,"Justificado"]
[null,null,"Criterio 89. Mecanismos de vigilancia y supervisión",0,"Justificado"]
[null,null,"Criterio 90. Hipervínculo en su caso, al (los) Informe(s) de avance físicos en versión pública si así corresponde",0,"Justificado"]
[null,null,"Criterio 91. Hipervínculo, en su caso, al (los) Informe(s) de avance financieros, en versión pública si así corresponde",0,"Justificado"]
[null,null,"Criterio 92. Hipervínculo al acta de recepción física de los trabajos ejecutados u homóloga",{"$f":"IF(E110=\"Justificado\",0,1)","v":0},"Justificado"]
[null,null,"Criterio 93. Hipervínculo al finiquito",{"$f":"IF(E111=\"Justificado\",0,1)","v":0},"Justificado"]
[]
[]
[]
[]
[null,null,"Criterios Sustantivos de contenido \nLTG 2018 - LTG 2020 (DOF 28/12/20) ",{"$f":"COUNTA(F119:F247)","v":1}]
[]
[null,null,"Criterio",null,"Valoración","Tipo","Observaciones, Recomendaciones y/o Requerimientos"]
[null,null,"Criterio 1. Ejercicio ",{"$f":"IF(E119=\"Justificado\",0,1)","v":1}]
[null,null,"Criterio 2. Periodo que se informa (fecha de inicio y fecha de término con el formato día/mes/año)",{"$f":"IF(E120=\"Justificado\",0,1)","v":1}]
[null,null,"Criterio 3. Tipo de procedimiento (catálogo): Licitación pública/Invitación a cuando menos tres personas/ Otra (especificar). En caso de que no se haya llevado a cabo alguno de los tres procedimientos en el periodo que se informa, se deberá incluir un registro con el periodo respectivo, el procedimiento y señalar mediante una nota fundamentada, motivada y actualizada al periodo correspondiente, que no se llevó a cabo ningún procedimiento de ese tipo.",1]
[null,null,"Criterio 4. Materia o tipo de contratación (catálogo): Obra pública/Servicios relacionados con obra pública/Adquisiciones/Arrendamientos/Servicios - Criterio Modificado DOF 28/12/2020",1]
[null,null,"Criterio 5. Carácter del procedimiento (catálogo): Nacional/Internacional - Criterio adicionado DOF 28/12/2020",1]
[null,null,"Criterio 6. En el caso de personas físicas: nombre[s], primer apellido, segundo apellido. En el caso de persona moral: razón social. En su caso, incluir una leyenda señalando que no se realizaron cotizaciones - Criterio Modificado DOF 28/12/2020",1]
[null,null,"Criterio 7. Registro Federal de Contribuyentes (RFC) de las personas físicas o morales de los posibles contratantes",1]
[null,null,"Criterio 8 Número de expediente, folio o nomenclatura que identifique a cada procedimiento",1]
[null,null,"Criterio 9. Hipervínculo a la convocatoria o invitaciones emitidas",1]
[null,null,"Criterio 10. Fecha de la convocatoria o invitación, expresada con el formato día/mes/año ",1]
[null,null,"Criterio 11 Descripción de las obras públicas, los bienes o los servicios contratados",1]
[null,null,"Criterio 12 En el caso de personas físicas: nombre[s], primer apellido, segundo apellido. En el caso de persona moral: razón social\nCriterio Modificado DOF 28/12/2020",1]
[null,null,"Criterio 13. Registro Federal de Contribuyentes (RFC) de las personas físicas o morales que presentaron una proposición u oferta",1]
[null,null,"Criterio 14. Fecha en la que se celebró la junta de aclaraciones, expresada con el formato día/mes/año ",1]
[null,null,"Criterio 15. Relación con los nombres de los asistentes a la junta de aclaraciones: Criterio 15 Nombre[s], primer apellido, segundo apellido. En el caso de personas morales especificar su denominación o razón social -\nCriterio Modificado DOF 28/12/2020",1]
[null,null,"Criterio 16. Registro Federal de Contribuyentes (RFC) de las personas físicas o morales asistentes a la junta de aclaraciones",1]
[null,null,"Criterio 17. Relación con los nombres de los servidores públicos asistentes a la junta de aclaraciones:  Nombre[s], primer apellido, segundo apellido) - \nCriterio Modificado DOF 28/12/2020",1]
[null,null,"Criterio 18. Registro Federal de Contribuyentes (RFC) de los servidores públicos asistentes a la junta de aclaraciones",1]
[null,null,"Criterio 19. Cargo que ocupan en el sujeto obligado los servidores públicos asistentes a la junta de aclaraciones",1]
[null,null,"Criterio 20. Hipervínculo al fallo de la junta de aclaraciones o al documento correspondiente",1]
[null,null,"Criterio 21. Hipervínculo al documento donde conste la presentación las propuestas",1]
[null,null,"Criterio 22. Hipervínculo, en su caso, al (los) dictamen(es)",1]
[null,null,"Criterio 23. Nombre completo o razón social del contratista o proveedor (en el caso de personas físicas: nombre[s], primer apellido, segundo apellido)",1]
[null,null,"Criterio 24. RFC de la persona física o moral contratista o proveedor",1]
[null,null,"Criterio 25 Domicilio fiscal de la empresa, contratista o proveedor (tipo de vialidad [catálogo],  nombre de vialidad [calle], número exterior, número interior [en su caso], Tipo de asentamiento humano [catálogo], nombre de asentamiento humano [colonia], clave de la localidad, nombre de la localidad, clave del municipio, nombre del municipio o delegación, clave de la entidad federativa, nombre de la entidad federativa [catálogo], código postal), es decir, el proporcionado ante el SAT - Criterio Adicionado DOF 28/12/2020",1]
[null,null,"Criterio 26 Domicilio en el extranjero. En caso de que la empresa, proveedor o contratista sea de otro país, se deberá especificar, por lo menos: país, ciudad, calle y número - Criterio Adicionado DOF 28/12/2020",1]
[null,null,"Criterio 27. Descripción breve de las razones que justifican la elección del/los proveedor/es o contratista/s",1]
[null,null,"Criterio 28. Área(s) solicitante(s) de las obras públicas, el arrendamiento, la adquisición de bienes y/o la prestación de servicios",1]
[null,null,"Criterio 29. Área(s) contratante(s)",1]
[null,null,"Criterio 30. Área(s) responsable de la ejecución",1]
[null,null,"Criterio 31 Número que identifique al contrato",1]
[null,null,"Criterio 32. Fecha del contrato, expresada con el formato día/mes/año ",1]
[null,null,"Criterio 33. Fecha de inicio de la vigencia del contrato, expresada con el formato día/mes/año - Criterio Adicionado DOF 28/12/2020",1]
[null,null,"Criterio 34 Fecha de término de la vigencia del contrato, expresada con el formato día/mes/año - Criterio Adicionado DOF 28/12/2020",1]
[null,null,"Criterio 35. Monto del contrato sin impuestos incluidos (expresados en pesos mexicanos)",1]
[null,null,"Criterio 36. Monto total del contrato con impuestos incluidos (expresados en pesos mexicanos)",1]
[null,null,"Criterio 37. Monto mínimo con impuestos incluidos, en su caso",1]
[null,null,"Criterio 38. Monto máximo con impuestos incluidos, en su caso",1]
[null,null,"Criterio 39. Tipo de moneda. Por ejemplo: Peso, Dólar, Euro, Libra, Yen",1]
[null,null,"Criterio 40. Tipo de cambio de referencia, en su caso",1]
[null,null,"Criterio 41. Forma de pago. Por ejemplo: efectivo, cheque o transacción bancaria",1]
[null,null,"Criterio 42. Objeto del contrato",1]
[null,null,"Criterio 43. Fecha de inicio expresada con el formato día/mes/año ",1]
[null,null,"Criterio 44. Fecha de término expresada con el formato día/mes/año",1]
[null,null,"Criterio 45. Hipervínculo al documento del contrato y sus anexos, en versión pública si así corresponde",1]
[null,null,"Criterio 46. Hipervínculo, en su caso al comunicado de suspensión, rescisión o terminación anticipada del contrato",1]
[null,null,"Criterio 47. Partida presupuestal. Catálogo de acuerdo con el Clasificador por Objeto del Gasto en el caso de ser aplicable",1]
[null,null,"Criterio 48. Origen de los recursos públicos (catálogo): Federales / Estatales / Municipales",1]
[null,null,"Criterio 49 Fuente de financiamiento. Por ejemplo: Recursos fiscales, financiamientos internos, financiamientos externos, ingresos propios, recursos federales, recursos estatales,",1]
[null,null,"Criterio 50. Tipo de fondo de participación o aportación respectiva (en caso de que se haya elegido en el criterio 49 la opción \"recursos federales\", \"recursos estatales\" u \"otros recursos\") - Criterio Modificado DOF 28/12/2020",1]
[null,null,"Criterio 51. Lugar donde se realizará la obra pública y/o servicio relacionado con la misma",1]
[null,null,"Criterio 52. Breve descripción de la obra pública",1]
[null,null,"Criterio 53 Hipervínculo a los estudios de impacto urbano y ambiental. En su caso, señalar que no se realizaron",1]
[null,null,"Criterio 54 Incluir, en su caso, observaciones dirigidas a la población relativas a la realización de las obras públicas, tales como: cierre de calles, cambio de circulación, impedimentos de paso, etcétera",1]
[null,null,"Criterio 55. Etapa de la obra pública y/o servicio de la misma (catálogo): En planeación/ En progreso/ Finiquito",1]
[null,null,"Criterio 56. Se realizaron convenios modificatorios (catálogo): Sí/ No",1]
[null,null,"Criterio 57. Número de convenio modificatorio que recaiga a la contratación; en su caso, señalar que no se realizó",1]
[null,null,"Criterio 58. Objeto del convenio modificatorio",1]
[null,null,"Criterio 59. Fecha de firma del convenio modificatorio, expresada con el formato día/mes/año ",1]
[null,null,"Criterio 60. Hipervínculo al documento del convenio, en versión pública si así corresponde",1]
[null,null,"Criterio 61. Mecanismos de vigilancia y supervisión de la ejecución, especificados en los contratos y/o convenios, en su caso",1]
[null,null,"Criterio 62. Hipervínculo, en su caso, al (los) informe(s) de avance físicos en versión pública si así corresponde",1]
[null,null,"Criterio 63. Hipervínculo, en su caso, al (los) informe(s) de avance financieros, en versión pública si así corresponde",1]
[null,null,"Criterio 64. Hipervínculo al acta de recepción física de los trabajos ejecutados u homóloga, en su caso",1]
[null,null,"Criterio 65. Hipervínculo al finiquito, contrato sin efectos concluido con anticipación o informe de resultados, en su caso - Criterio Modificado 28/12/2020",1]
[null,null,"Criterio 66. Ejercicio ",{"$f":"IF(E184=\"Justificado\",0,1)","v":1}]
[null,null,"Criterio 67. Periodo que se informa (fecha de inicio y fecha de término con el formato día/mes/año)",1]
[null,null,"Criterio 68. Tipo de procedimiento (catálogo): Adjudicación directa/ Otra (especificar)",1]
[null,null,"Criterio 69. Materia (catálogo): Obra pública/Servicios relacionados con obra pública/Adquisiciones/Arrendamientos/Servicios",1]
[null,null,"Criterio 70. Carácter del procedimiento (catálogo): Nacional/Internacional\nCriterio Adicionado 28/12/2020",1]
[null,null,"Criterio 71. Número de expediente, folio o nomenclatura que lo identifique",1]
[null,null,"Criterio 72. Los motivos y fundamentos legales aplicados para realizar la adjudicación directa",1]
[null,null,"Criterio 73. Hipervínculo a la autorización o documento que dé cuenta de la suficiencia de recursos para efectuar el procedimiento - Criterio Modificado DOF 28/12/2020",1]
[null,null,"Criterio 74. Descripción de las obras, los bienes, servicios, requisiciones u orden de servicio contratados y/o adquiridos",1]
[null,null,"Criterio 75. Nombre completo o razón social de los posibles contratantes (personas físicas: nombre[s], primer apellido, segundo apellido). En su caso, incluir una nota señalando que no se realizaron cotizaciones",1]
[null,null,"Criterio 76. Registro Federal de Contribuyentes (RFC) de las personas físicas o morales posibles contratantes",1]
[null,null,"Criterio 77. Monto total de la cotización con impuestos incluidos",1]
[null,null,"Criterio 78. Nombre o razón social del adjudicado (en el caso de personas físicas: nombre[s], primer apellido, segundo apellido)",1]
[null,null,"Criterio 79. Registro Federal de Contribuyentes (RFC) de la persona física o moral adjudicada ",1]
[null,null,"Criterio 80. Domicilio fiscal de la empresa, contratista o proveedor (tipo de vialidad [catálogo], nombre de vialidad [calle], número exterior, número interior [en su caso], Tipo de asentamiento humano [catálogo], nombre de asentamiento humano [colonia], clave de la localidad, nombre de la localidad, clave del municipio, nombre del municipio o delegación, clave de la entidad federativa, nombre de la entidad federativa [catálogo], código postal), es decir, el proporcionado ante el SAT - Criterio Adicionado DOF 28/12/2020",1]
[null,null,"Criterio 81. Domicilio en el extranjero. En caso de que la empresa, proveedor o contratista sea de otro país, se deberá incluir el domicilio el cual deberá incluir por lo menos: país, ciudad, calle y número - Criterio Adicionado DOF 28/12/2020",1]
[null,null,"Criterio 82. Área(s) solicitante(s) ",1]
[null,null,"Criterio 83. Área(s) responsable(s) de la ejecución del contrato ",1]
[null,null,"Criterio 84. Número que identifique al contrato",1]
[null,null,"Criterio 85. Fecha del contrato, expresada con el formato día/mes/año",1]
[null,null,"Criterio 86. Fecha de inicio de la vigencia del contrato, expresada con el formato día/mes/año - Criterio Adicionado DOF 28/12/2020",1]
[null,null,"Criterio 87. Fecha de término de la vigencia del contrato, expresada con el formato día/mes/año. Criterio Adicionado DOF 28/12/2020",1]
[null,null,"Criterio 88 Monto del contrato sin impuestos incluidos (expresados en pesos mexicanos)",1]
[null,null,"Criterio 89. Monto total del contrato con impuestos incluidos (expresado en pesos mexicanos)",1]
[null,null,"Criterio 90. Monto mínimo, con impuestos incluidos, en su caso",1]
[null,null,"Criterio 91. Monto máximo, con impuestos incluidos, en su caso",1]
[null,null,"Criterio 92. Tipo de moneda, por ejemplo: Peso, Dólar, Euro, Libra, Yen",1]
[null,null,"Criterio 93. Tipo de cambio de referencia, en su caso",1]
[null,null,"Criterio 94. Forma de pago (por ejemplo: efectivo, cheque o transacción bancaria)",1]
[null,null,"Criterio 95. Objeto del contrato",1]
[null,null,"Criterio 96. Monto total de las garantías y/o contragarantías que, en su caso, se hubieren otorgado durante el procedimiento respectivo",1]
[null,null,"Criterio 97. Fecha de inicio expresada con el formato día/mes/año del plazo de entrega o de ejecución de los servicios contratados u obra pública a realizar ",1]
[null,null,"Criterio 98. Fecha de término expresada con el formato día/mes/año del plazo de entrega o de ejecución de los servicios contratados u obra pública a realizar ",1]
[null,null,"Criterio 99. Hipervínculo al documento del contrato y sus anexos, en versión pública si así corresponde",1]
[null,null,"Criterio 100. Hipervínculo, en su caso al comunicado de suspensión, rescisión o terminación anticipada del contrato",1]
[null,null,"Criterio 101. Origen de los recursos públicos por ejemplo Federales, estatales, delegacionales, municipales",1]
[null,null,"Criterio 102. Fuentes de financiamiento por ejemplo: Recursos Fiscales, financiamientos internos, financiamientos externos, ingresos propios, recursos federales, recursos estatales,",1]
[null,null,"Criterio 103. Lugar donde se realizará la obra pública y/o servicio relacionado con la misma",1]
[null,null,"Criterio 104. Hipervínculo a los estudios de impacto urbano y ambiental. En su caso, señalar que no se realizaron",1]
[null,null,"Criterio 105. Incluir, en su caso, observaciones dirigidas a la población relativas a la realización de las obras públicas, tales como: cierre de calles, cambio de circulación, impedimentos de paso, etcétera",1]
[null,null,"Criterio 106. Etapa de la obra pública y/o servicio de la misma (catálogo): En planeación/ En progreso/ Finiquito",1]
[null,null,"Criterio 107. Se realizaron convenios modificatorios (catálogo): Sí / No",1]
[null,null,"Criterio 108. Número que le corresponde al(los) convenio(s) modificatorio(s) que recaiga(n) a la contratación",1]
[null,null,"Criterio 109. Objeto del convenio",1]
[null,null,"Criterio 110. Fecha de firma del convenio, expresada con el formato día/mes/año ",1]
[null,null,"Criterio 111. Hipervínculo al documento del convenio, en versión pública si así corresponde",1]
[null,null,"Criterio 112. Mecanismos de vigilancia y supervisión",1]
[null,null,"Criterio 113. Hipervínculo en su caso, al (los) Informe(s) de avance físicos en versión pública si así corresponde",1]
[null,null,"Criterio 114. Hipervínculo, en su caso, al (los) Informe(s) de avance financieros, en versión pública si así corresponde",1]
[null,null,"Criterio 115. Hipervínculo al acta de recepción física de los trabajos ejecutados u homóloga",1]
[null,null,"Criterio 116.Hipervínculo al finiquito, contrato sin efectos concluido con anticipación o informe de resultados, en su caso - Criterio Modificado DOF 28/12/2020",1]
[]
[null,null,"Criterios Adjetivos LTG 2018 - LTG 2020 (DOF 28/12/20) "]
[]
[null,null,"Criterio",null,"Valoración","Tipo","Observaciones, Recomendaciones y/o Requerimientos"]
[null,null,"Criterio 117. Periodo de actualización de la información: trimestral",{"$f":"IF(E239=\"Justificado\",0,1)","v":1}]
[null,null,"Criterio 118. La información publicada deberá estar actualizada al periodo que corresponde de acuerdo con la Tabla de actualización y conservación de la información",1]
[null,null,"Criterio 119. Conservar en el sitio de Internet: información vigente, es decir, los instrumentos jurídicos vigentes, contratos y convenios, aun cuando éstos sean de ejercicios anteriores; la generada en el ejercicio en curso y la\ncorrespondiente a dos ejercicios anteriores.",1]
[null,null,"Criterio 120. Área(s) responsable(s) que genera(n), posee(n), publica(n) y/o actualiza(n) la información  ",1]
[null,null,"Criterio 121. Fecha de actualización de la información publicada con el formato día/mes/año",1]
[null,null,"Criterio 122. Fecha de validación de la información publicada con el formato día/mes/año",1]
[null,null,"Criterio 123. Nota. Este criterio se cumple en caso de que sea necesario que el sujeto obligado incluya alguna aclaración relativa a la información publicada y/o explicación por la falta de información ",1]
[null,null,"Criterio 124. La información publicada se organiza mediante los formatos 28a y 28b, en los que se incluyen todos los campos especificados en los criterios sustantivos de contenido",1]
[null,null,"Criterio 125. El soporte de la información permite su reutilización",1]
{"$rows_empty":7}
[{"$nulls":3},2017,2018]
[null,null,"CS",{"$f":"IF(Aplicabilidad!G39<>\"SI\",\"NA\",SUM(E19:E111)/SUM(D19:D111))","v":"NA"},{"$f":"IF(Aplicabilidad!G39<>\"SI\",\"NA\",SUM(E119:E234)/SUM(D119:D234))","v":"NA"}]
[null,null,"CA",{"$f":"IF(Aplicabilidad!G39<>\"SI\",\"NA\",SUM(#REF!)/SUM(#REF!))","v":"NA"},{"$f":"IF(Aplicabilidad!G39<>\"SI\",\"NA\",SUM(E239:E247)/SUM(D239:D247))","v":"NA"}]
[null,null,"OBLIGACIÓN",{"$f":"IF(Aplicabilidad!G39<>\"SI\",\"NA\",D256*0.6+D257*0.4)","v":"NA"},{"$f":"IF(Aplicabilidad!G39<>\"SI\",\"NA\",E256*0.6+E257*0.4)","v":"NA"}]

{"sheet":"Art 74_XXIX","index":31,"n_rows":65,"n_cols":7,"rows_kept":65,"merged":[[0,2,0,6],[4,1,4,7],[14,4,14,6],[29,4,29,6]]}
[null,null,{"$f":"IF(Aplicabilidad!E2=\"\",\"\",Aplicabilidad!E2)","v":"Consejería Jurídica"}]
[]
[null,"Códigos de valoración : Cumplió totalmente = 1; Cumplió parcialmente = 0.5; No cumplió = 0; Justificado = Justificado"]
[]
[null,"Art. 74 - Fracción XXIX. Informes"]
[]
[null,null,"Fecha de Inicio de la Verificación:",{"$nulls":3},"Fecha de Término de la verificación"]
[null,null,{"$f":"IF(Resultados!$C$7=\"\",\"\",Resultados!$C$7)","v":"2021-07-07"},"2018-05-25",null,null,{"$f":"IF(Resultados!G7=\"\",\"\",Resultados!G7)","v":"2021-07-08"}]
[]
[null,null,"Criterios Sustantivos",null,{"$f":"IF(Aplicabilidad!G40<>\"SI\",\"NA\",(SUM(E19:E26)+SUM(E34:E41))/(SUM(D19:D26)+SUM(D34:D41)))","v":{"v":0.875,"d":"88%"}}]
[null,null,"Criterios Adjetivos",null,{"$f":"IF(Aplicabilidad!G40<>\"SI\",\"NA\",(SUM(E46:E54))/(SUM(D46:D54)))","v":{"v":1,"d":"100%"}}]
[null,null,"Obligación",null,{"$f":"IF(Aplicabilidad!G40<>\"SI\",\"NA\",E10*0.6+E11*0.4)","v":{"v":0.925,"d":"92.50%"}}]
[]
[]
[]
[null,null,"Criterios Sustantivos de contenido \nLTG 2018 - LTG 2020 (DOF 28/12/20) ",{"$f":"COUNTA(F19:F27)","v":0}]
[]
[null,null,"Criterio",null,"Valoración","Tipo","Observaciones, Recomendaciones y/o Requerimientos"]
[null,null,"Criterio 1. Ejercicio",{"$f":"IF(E19=\"Justificado\",0,1)","v":0},"Justificado"]
[null,null,"Criterio 2. Periodo que se informa",{"$f":"IF(E20=\"Justificado\",0,1)","v":0},"Justificado"]
[null,null,"Criterio 3. Denominación de cada uno de los informes, que por ley debe emitir el sujeto obligado.",0,"Justificado"]
[null,null,"Criterio 4. Denominación del área responsable de la elaboración y/o presentación del informe",0,"Justificado"]
[null,null,"Criterio 5. Fundamento legal para la elaboración y/o presentación del informe (normatividad, artículo, fracción)",0,"Justificado"]
[null,null,"Criterio 6. Periodicidad para elaborar y/o presentar el informe (mensual, bimestral, trimestral, tetramestral, semestral, anual, sexenal)",0,"Justificado"]
[null,null,"Criterio 7. Fecha en la que se presentó y/o entregó con el formato día/mes/año (ej. 31/Marzo/2016)",{"$f":"IF(E25=\"Justificado\",0,1)","v":0},"Justificado"]
[null,null,"Criterio 8. Hipervínculo al documento del informe que corresponda",{"$f":"IF(E26=\"Justificado\",0,1)","v":0},"Justificado"]
[]
[]
[]
[]
[null,null,"Criterios Sustantivos de contenido LTG 2018 - LTG 2020 (DOF 28/12/20) ",{"$f":"COUNTA(F34:F54)","v":3}]
[]
[null,null,"Criterio",null,"Valoración","Tipo","Observaciones, Recomendaciones y/o Requerimientos"]
[null,null,"Criterio 1. Ejercicio",{"$f":"IF(E34=\"Justificado\",0,1)","v":1},1]
[null,null,"Criterio 2. Periodo que se informa (fecha de inicio y fecha de término con el formato día/mes/año)",{"$f":"IF(E35=\"Justificado\",0,1)","v":1},1]
[null,null,"Criterio 3. Denominación de cada informe, que por ley debe generar el sujeto obligado.",1,1]
[null,null,"Criterio 4. Denominación del área responsable de la elaboración y/o presentación del informe",1,1]
[null,null,"Criterio 5. Fundamento legal para la elaboración y/o presentación del informe (normatividad, artículo, fracción)",1,1]
[null,null,"Criterio 6. Periodicidad para elaborar y/o presentar el informe. Por ejemplo: mensual, bimestral, trimestral, tetramestral, semestral, anual, sexenal",1,1]
[null,null,"Criterio 7. Fecha en la que se presentó y/o entregó con el formato día/mes/año ",{"$f":"IF(E40=\"Justificado\",0,1)","v":1},0.5,"Requerimiento","Existen registros en el ejercicio 2021 donde no hay información publicada ni nota informativa que justifique la falta de información."]
[null,null,"Criterio 8. Hipervínculo al documento del informe que corresponda",{"$f":"IF(E41=\"Justificado\",0,1)","v":1},0.5,"Requerimiento","Existen registros en el ejercicio 2021 donde no hay información publicada ni nota informativa que justifique la falta de información."]
[]
[null,null,"Criterios Adjetivos LTG 2018 - LTG 2020 (DOF 28/12/20) "]
[]
[null,null,"Criterio",null,"Valoración","Tipo","Observaciones, Recomendaciones y/o Requerimientos"]
[null,null,"Criterio 9. Periodo de actualización de la información: trimestral",{"$f":"IF(E46=\"Justificado\",0,1)","v":1},1]
[null,null,"Criterio 10. La información publicada deberá estar actualizada al periodo que corresponde de acuerdo con la Tabla de actualización y conservación de la información",1,1]
[null,null,"Criterio 11. Conservar en el sitio de Internet: información del ejercicio en curso y la correspondiente a dos ejercicios anteriores",1,1]
[null,null,"Criterio 12. Área(s) responsable(s) que genera(n), posee(n), publica(n) y/o actualiza(n) la información ",1,1]
[null,null,"Criterio 13. Fecha de actualización de la información publicada con el formato día/mes/año",1,1]
[null,null,"Criterio 14. Fecha de validación de la información publicada con el formato día/mes/año",1,1]
[null,null,"Criterio 15. Nota. Este criterio se cumple en caso de que sea necesario que el sujeto obligado incluya alguna aclaración relativa a la información publicada y/o explicación por la falta de información ",1,1]
[null,null,"Criterio 16. La información publicada se organiza mediante el formato 29, en el que se incluyen todos los campos especificados en los criterios sustantivos de contenido",1,1]
[null,null,"Criterio 17. El soporte de la información permite su reutilización",1,1]
{"$rows_empty":7}
[{"$nulls":3},2017,2018]
[null,null,"CS",{"$f":"IF(Aplicabilidad!G40<>\"SI\",\"NA\",SUM(E19:E26)/SUM(D19:D26))","v":{"$error":"#DIV/0!"}},{"$f":"IF(Aplicabilidad!G40<>\"SI\",\"NA\",SUM(E34:E41)/SUM(D34:D41))","v":{"v":0.875,"d":"87.50%"}}]
[null,null,"CA",{"$f":"IF(Aplicabilidad!G40<>\"SI\",\"NA\",SUM(#REF!)/SUM(#REF!))","v":{"$error":"#REF!"}},{"$f":"IF(Aplicabilidad!G40<>\"SI\",\"NA\",SUM(E46:E54)/SUM(D46:D54))","v":{"v":1,"d":"100.00%"}}]
[null,null,"OBLIGACIÓN",{"$f":"IF(Aplicabilidad!G40<>\"SI\",\"NA\",D63*0.6+D64*0.4)","v":{"$error":"#DIV/0!"}},{"$f":"IF(Aplicabilidad!G40<>\"SI\",\"NA\",E63*0.6+E64*0.4)","v":{"v":0.925,"d":"92.50%"}}]

{"sheet":"Art 74_XXX","index":32,"n_rows":69,"n_cols":7,"rows_kept":69,"hidden":true,"merged":[[0,2,0,6],[4,1,4,7],[14,4,14,6],[31,4,31,6]]}
[null,null,{"$f":"IF(Aplicabilidad!E2=\"\",\"\",Aplicabilidad!E2)","v":"Consejería Jurídica"}]
[]
[null,"Códigos de valoración : Cumplió totalmente = 1; Cumplió parcialmente = 0.5; No cumplió = 0; Justificado = Justificado"]
[]
[null,"Art. 74 - Fracción XXX. Estadísticas generadas"]
[]
[null,null,"Fecha de Inicio de la Verificación:",{"$nulls":3},"Fecha de Término de la verificación"]
[null,null,{"$f":"IF(Resultados!$C$7=\"\",\"\",Resultados!$C$7)","v":"2021-07-07"},"2018-05-25",null,null,{"$f":"IF(Resultados!G7=\"\",\"\",Resultados!G7)","v":"2021-07-08"}]
[]
[null,null,"Criterios Sustantivos",null,{"$f":"IF(Aplicabilidad!G41<>\"SI\",\"NA\",(SUM(E19:E28)+SUM(E36:E45))/(SUM(D19:D28)+SUM(D36:D45)))","v":"NA"}]
[null,null,"Criterios Adjetivos",null,{"$f":"IF(Aplicabilidad!G41<>\"SI\",\"NA\",(SUM(E50:E58))/(SUM(D50:D58)))","v":"NA"}]
[null,null,"Obligación",null,{"$f":"IF(Aplicabilidad!G41<>\"SI\",\"NA\",E10*0.6+E11*0.4)","v":"NA"}]
[]
[]
[]
[null,null,"Criterios Sustantivos de contenido 2015 -2017",{"$f":"COUNTA(F19:F29)","v":0}]
[]
[null,null,"Criterio",null,"Valoración","Tipo","Observaciones, Recomendaciones y/o Requerimientos"]
[null,null,"Criterio 1. Ejercicio",{"$f":"IF(E19=\"Justificado\",0,1)","v":1}]
[null,null,"Criterio 2. Listado con las denominaciones temáticas de las estadísticas que genera el sujeto obligado",{"$f":"IF(E20=\"Justificado\",0,1)","v":1}]
[null,null,"Criterio 3. Periodo de actualización de datos: Quincenal / Mensual / Bimestral / Trimestral / Anual Sexenal / Otro (especificar)",1]
[null,null,"Criterio 4. Periodo que se informa",1]
[null,null,"Criterio 5. Denominación del proyecto",1]
[null,null,"Criterio 6. Descripción de variables",1]
[null,null,"Criterio 7. Documentos técnicos, metodológicos y normativos relacionados con la generación de estadísticas y el manejo de las bases de datos",1]
[null,null,"Criterio 8. Tipos de archivo de las bases de datos: HTML / XLS / IQY / CSV / XML / SAV / Otro (especificar)",1]
[null,null,"Criterio 9. Hipervínculo a las bases de datos respectivas",{"$f":"IF(E27=\"Justificado\",0,1)","v":1}]
[null,null,"Criterio 10. Hipervínculo a las series o bancos de datos existentes",{"$f":"IF(E28=\"Justificado\",0,1)","v":1}]
[]
[]
[]
[]
[null,null,"Criterios Sustantivos de contenido \nLTG 2018 - LTG 2020 (DOF 28/12/20) ",{"$f":"COUNTA(F36:F58)","v":1}]
[]
[null,null,"Criterio",null,"Valoración","Tipo","Observaciones, Recomendaciones y/o Requerimientos"]
[null,null,"Criterio 1. Ejercicio",{"$f":"IF(E36=\"Justificado\",0,1)","v":1}]
[null,null,"Criterio 2. Periodo que se informa (fecha de inicio y fecha de término con el formato día/mes/año)",{"$f":"IF(E37=\"Justificado\",0,1)","v":1}]
[null,null,"Criterio 3. Tema ",1]
[null,null,"Criterio 4. Periodo de actualización de datos. Por ejemplo, Quincenal, mensual, bimestral, trimestral, anual, sexenal",1]
[null,null,"Criterio 5. Denominación del proyecto",1]
[null,null,"Criterio 6. Hipervínculo al documento en el cual se describan las variables",1]
[null,null,"Criterio 7. Hipervínculo a los documentos técnicos, metodológicos y normativos relacionados con la generación de estadísticas y el manejo de las bases de datos",1]
[null,null,"Criterio 8. Tipos de archivo de las bases de datos. Por ejemplo HTML, XLS, IQY, CSV, XML, SAV",1]
[null,null,"Criterio 9. Hipervínculo a las bases de datos respectivas. Las bases de datos deberán corresponder directamente con el proyecto que se está informando",{"$f":"IF(E44=\"Justificado\",0,1)","v":1}]
[null,null,"Criterio 10. Hipervínculo a las series o bancos de datos existentes. Las series o banco de datos deberán corresponder directamente con el tema estadístico que se está informando",{"$f":"IF(E45=\"Justificado\",0,1)","v":1}]
[]
[null,null,"Criterios Adjetivos LTG 2018 - LTG 2020 (DOF 28/12/20) "]
[]
[null,null,"Criterio",null,"Valoración","Tipo","Observaciones, Recomendaciones y/o Requerimientos"]
[null,null,"Criterio 11. Periodo de actualización de la información: trimestral",{"$f":"IF(E50=\"Justificado\",0,1)","v":1}]
[null,null,"Criterio 12. La información publicada deberá estar actualizada al periodo que corresponde de acuerdo con la Tabla de actualización y conservación de la información",1]
[null,null,"Criterio 13. Conservar en el sitio de Internet y a través de la Plataforma Nacional la información de acuerdo con la Tabla de actualización y conservación de la información",1]
[null,null,"Criterio 14. Área(s) responsable(s) que genera(n), posee(n), publica(n) y/o actualiza(n) la información ",1]
[null,null,"Criterio 15. Fecha de actualización de la información publicada con el formato día/mes/año",1]
[null,null,"Criterio 16. Fecha de validación de la información publicada con el formato día/mes/año",1]
[null,null,"Criterio 17. Nota. Este criterio se cumple en caso de que sea necesario que el sujeto obligado incluya alguna aclaración relativa a la información publicada y/o explicación por la falta de información ",1]
[null,null,"Criterio 18. La información publicada se organiza mediante el formato 30, en el que se incluyen todos los campos especificados en los criterios sustantivos de contenido",1]
[null,null,"Criterio 19. El soporte de la información permite su reutilización",1]
{"$rows_empty":7}
[{"$nulls":3},2017,2018]
[null,null,"CS",{"$f":"IF(Aplicabilidad!G41<>\"SI\",\"NA\",SUM(E19:E28)/SUM(D19:D28))","v":"NA"},{"$f":"IF(Aplicabilidad!G41<>\"SI\",\"NA\",SUM(E36:E45)/SUM(D36:D45))","v":"NA"}]
[null,null,"CA",{"$f":"IF(Aplicabilidad!G41<>\"SI\",\"NA\",SUM(#REF!)/SUM(#REF!))","v":"NA"},{"$f":"IF(Aplicabilidad!G41<>\"SI\",\"NA\",SUM(E50:E58)/SUM(D50:D58))","v":"NA"}]
[null,null,"OBLIGACIÓN",{"$f":"IF(Aplicabilidad!G41<>\"SI\",\"NA\",D67*0.6+D68*0.4)","v":"NA"},{"$f":"IF(Aplicabilidad!G41<>\"SI\",\"NA\",E67*0.6+E68*0.4)","v":"NA"}]

{"sheet":"Art 74_XXXI","index":33,"n_rows":80,"n_cols":7,"rows_kept":80,"merged":[[0,2,0,6],[4,1,4,7],[14,4,14,6],[32,4,32,6]]}
[null,null,{"$f":"IF(Aplicabilidad!E2=\"\",\"\",Aplicabilidad!E2)","v":"Consejería Jurídica"}]
[]
[null,"Códigos de valoración : Cumplió totalmente = 1; Cumplió parcialmente = 0.5; No cumplió = 0; Justificado = Justificado"]
[]
[null,"Art. 74 - Fracción XXXI. Informes de avances y documentos financieros"]
[]
[null,null,"Fecha de Inicio de la Verificación:",{"$nulls":3},"Fecha de Término de la verificación"]
[null,null,{"$f":"IF(Resultados!$C$7=\"\",\"\",Resultados!$C$7)","v":"2021-07-07"},"2018-05-25",null,null,{"$f":"IF(Resultados!G7=\"\",\"\",Resultados!G7)","v":"2021-07-08"}]
[]
[null,null,"Criterios Sustantivos",null,{"$f":"IF(Aplicabilidad!G42<>\"SI\",\"NA\",(SUM(E19:E29)+SUM(E37:E56))/(SUM(D19:D29)+SUM(D37:D56)))","v":{"v":0.8148148148148148,"d":"81%"}}]
[null,null,"Criterios Adjetivos",null,{"$f":"IF(Aplicabilidad!G42<>\"SI\",\"NA\",(SUM(E61:E69))/(SUM(D61:D69)))","v":{"v":1,"d":"100%"}}]
[null,null,"Obligación",null,{"$f":"IF(Aplicabilidad!G42<>\"SI\",\"NA\",E10*0.6+E11*0.4)","v":{"v":0.8888888888888888,"d":"88.89%"}}]
[]
[]
[]
[null,null,"Criterios Sustantivos de contenido 2015-2017",{"$f":"COUNTA(F19:F30)","v":0}]
[]
[null,null,"Criterio",null,"Valoración","Tipo","Observaciones, Recomendaciones y/o Requerimientos"]
[null,null,"Criterio 1. Ejercicio",{"$f":"IF(E19=\"Justificado\",0,1)","v":1},1]
[null,null,"Criterio 2. Periodo que se reporta",{"$f":"IF(E20=\"Justificado\",0,1)","v":1},1]
[null,null,"Criterio 3. Clave y denominación del capítulo, concepto y partidas, con base en la clasificación económica del gasto",1,1]
[null,null,"Criterio 4. Presupuesto asignado por capítulo, concepto y partidas, con base en la clasificación económica del gasto",1,1]
[null,null,"Criterio 5. Presupuesto modificado por capítulo, concepto y partidas, con base en la clasificación económica del gasto",1,1]
[null,null,"Criterio 6. Justificación de la modificación del presupuesto, en su caso",1,1]
[null,null,"Criterio 7. Presupuesto ejercido por capítulo, concepto y partidas, con base en la clasificación económica del gasto",1,1]
[null,null,"Criterio 8. Hipervínculo al informe trimestral de avance programático y presupuestal del sujeto obligado",1,1]
[null,null,"Criterio 9. Hipervínculo a los Balances generales (en su caso) del sujeto obligado",1,1]
[null,null,"Criterio 10. Hipervínculo al Estado financiero del sujeto obligado",{"$f":"IF(E28=\"Justificado\",0,1)","v":1},1]
[null,null,"Criterio 11. Hipervínculo al sitio de Internet de la Secretaría de Hacienda, las secretarías de finanzas o análogas de las Entidades Federativas, o a las tesorerías de los municipios y sus equivalentes en las demarcaciones territoriales del Distrito Federal, en el apartado donde se publica la información sobre el avance programático presupuestal trimestral y acumulado consolidado",{"$f":"IF(E29=\"Justificado\",0,1)","v":1},1]
[]
[]
[]
[]
[null,null,"Criterios Sustantivos de contenido LTG 2018 - LTG 2020 (DOF 28/12/20) ",{"$f":"COUNTA(F37:F69)","v":11}]
[]
[null,null,"Criterio",null,"Valoración","Tipo","Observaciones, Recomendaciones y/o Requerimientos"]
[null,null,"Criterio 1. Ejercicio",{"$f":"IF(E37=\"Justificado\",0,1)","v":1},1]
[null,null,"Criterio 2. Periodo que se informa (fecha de inicio y fecha de término con el formato día/mes/año)",{"$f":"IF(E38=\"Justificado\",0,1)","v":1},1]
[null,null,"Criterio 3. Clave del capítulo, con base en la clasificación por objeto del gasto - Criterio modificado DOF 28/12/2020",1,0.5,"Requerimiento","Existen registros donde no hay información publicada ni nota informativa que justifique la falta de información."]
[null,null,"Criterio 4. Clave del concepto, con base en la clasificación por objeto del gasto - Criterio modificado DOF 28/12/2020",1,0.5,"Requerimiento","Existen registros donde no hay información publicada ni nota informativa que justifique la falta de información."]
[null,null,"Criterio 5. Clave de la partida, con base en la clasificación por objeto del gasto - Criterio modificado DOF 28/12/2020",1,0.5,"Requerimiento","Existen registros donde no hay información publicada ni nota informativa que justifique la falta de información."]
[null,null,"Criterio 6.Denominación del capítulo, concepto y partida con base en la clasificación por objeto del gasto - Criterio modificado DOF 28/12/2020",1,0.5,"Requerimiento","Existen registros donde no hay información publicada ni nota informativa que justifique la falta de información."]
[null,null,"Criterio 7. Gasto aprobado por capítulo, concepto y partida, con base en la clasificación por objeto del gasto - Criterio modificado DOF 28/12/2020",1,0.5,"Requerimiento","Existen registros donde no hay información publicada ni nota informativa que justifique la falta de información."]
[null,null,"Criterio 8. Gasto modificado por capítulo, concepto y partidas, con base en la\nclasificación por objeto del gasto - Criterio modificado DOF 28/12/2020",1,0.5,"Requerimiento","Existen registros donde no hay información publicada ni nota informativa que justifique la falta de información."]
[null,null,"Criterio 9. Gasto comprometido por capítulo, concepto y partidas, con base en la clasificación por objeto del gasto - Criterio modificado DOF 28/12/2020",1,0.5,"Requerimiento","Existen registros donde no hay información publicada ni nota informativa que justifique la falta de información."]
[null,null,"Criterio 10. Gasto devengado por capítulo, concepto y partidas, con base en la clasificación por objeto del gasto - Criterio modificado DOF 28/12/2020",1,0.5,"Requerimiento","Existen registros donde no hay información publicada ni nota informativa que justifique la falta de información."]
[null,null,"Criterio 11. Gasto ejercido por capítulo, concepto y partidas, con base en la clasificación por objeto del gasto - Criterio modificado DOF 28/12/2020",1,0.5,"Requerimiento","Existen registros donde no hay información publicada ni nota informativa que justifique la falta de información."]
[null,null,"Criterio 12. Gasto pagado por capítulo, concepto y partidas, con base en la clasificación por objeto del gasto - Criterio modificado DOF 28/12/2020",1,0.5,"Requerimiento","Existen registros donde no hay información publicada ni nota informativa que justifique la falta de información."]
[null,null,"Criterio 13. Justificación de la modificación del presupuesto, en su caso",1,1]
[null,null,"Criterio 14. Hipervínculo al Estado analítico del ejercicio del Presupuesto de Egresos ",1,1]
[null,null,"Criterio 15. Ejercicio",1,1]
[null,null,"Criterio 16. Periodo que se informa (fecha de inicio y fecha de término con el formato día/mes/año)",1,1]
[null,null,"Criterio 17. Tipo de documento financiero (catálogo): Contable/Presupuestal/Programático",0,"Justificado"]
[null,null,"Criterio 18. Denominación del documento financiero contable, presupuestal y programático, aplicable al sujeto obligado",0,"Justificado"]
[null,null,"Criterio 19. Hipervínculo al documento financiero contable, presupuestal y programático, aplicable al sujeto obligado",{"$f":"IF(E55=\"Justificado\",0,1)","v":0},"Justificado"]
[null,null,"Criterio 20. Hipervínculo al sitio de Internet de la Secretaría de Hacienda, las secretarías de finanzas o análogas de las Entidades Federativas, o a las tesorerías de los municipios y sus equivalentes en la Ciudad de México, en el apartado donde se publica la información sobre el avance programático presupuestal trimestral y acumulado consolidado",{"$f":"IF(E56=\"Justificado\",0,1)","v":0},"Justificado"]
[]
[null,null,"Criterios Adjetivos LTG 2018 - LTG 2020 (DOF 28/12/20) "]
[]
[null,null,"Criterio",null,"Valoración","Tipo","Observaciones, Recomendaciones y/o Requerimientos"]
[null,null,"Criterio 21. Periodo de actualización de la información: trimestral; a más tardar 30 días naturales después del cierre del período que corresponda",{"$f":"IF(E61=\"Justificado\",0,1)","v":1},1]
[null,null,"Criterio 22. La información deberá estar actualizada al periodo que corresponde, de acuerdo con la Tabla de actualización y conservación de la información",1,1]
[null,null,"Criterio 23. Conservar en el sitio de Internet: información del ejercicio en curso y la correspondiente a los últimos seis ejercicios",1,1]
[null,null,"Criterio 24. Área(s) responsable(s) que genera(n) posee(n), publica(n) y/o actualiza(n) la información ",1,1]
[null,null,"Criterio 25. Fecha de actualización de la información publicada con el formato día/mes/año",1,1]
[null,null,"Criterio 26. Fecha de validación de la información publicada con el formato día/mes/año",1,1]
[null,null,"Criterio 27. Nota. Este criterio se cumple en caso de que sea necesario que el sujeto obligado incluya alguna aclaración relativa a la información publicada y/o explicación por la falta de información ",1,1]
[null,null,"Criterio 28. La información publicada se organiza mediante el formato 31a y 31b, en el que se incluyen todos los campos especificados en los criterios sustantivos de contenido",1,1]
[null,null,"Criterio 29. El soporte de la información permite su reutilización",1,1]
{"$rows_empty":7}
[{"$nulls":3},2017,2018]
[null,null,"CS",{"$f":"IF(Aplicabilidad!G42<>\"SI\",\"NA\",SUM(E19:E29)/SUM(D19:D29))","v":{"v":1,"d":"100.00%"}},{"$f":"IF(Aplicabilidad!G42<>\"SI\",\"NA\",SUM(E37:E56)/SUM(D37:D56))","v":{"v":0.6875,"d":"68.75%"}}]
[null,null,"CA",{"$f":"IF(Aplicabilidad!G42<>\"SI\",\"NA\",SUM(#REF!)/SUM(#REF!))","v":{"$error":"#REF!"}},{"$f":"IF(Aplicabilidad!G42<>\"SI\",\"NA\",SUM(E61:E69)/SUM(D61:D69))","v":{"v":1,"d":"100.00%"}}]
[null,null,"OBLIGACIÓN",{"$f":"IF(Aplicabilidad!G42<>\"SI\",\"NA\",D78*0.6+D79*0.4)","v":{"$error":"#REF!"}},{"$f":"IF(Aplicabilidad!G42<>\"SI\",\"NA\",E78*0.6+E79*0.4)","v":{"v":0.8125,"d":"81.25%"}}]

{"sheet":"Art 74_XXXII","index":34,"n_rows":91,"n_cols":7,"rows_kept":91,"hidden":true,"merged":[[0,2,0,6],[4,1,4,7],[14,4,14,6],[41,4,41,6]]}
[null,null,{"$f":"IF(Aplicabilidad!E2=\"\",\"\",Aplicabilidad!E2)","v":"Consejería Jurídica"}]
[]
[null,"Códigos de valoración : Cumplió totalmente = 1; Cumplió parcialmente = 0.5; No cumplió = 0; Justificado = Justificado"]
[]
[null,"Art. 74 - Fracción XXXII. Padrón proveedores y contratistas"]
[]
[null,null,"Fecha de Inicio de la Verificación:",{"$nulls":3},"Fecha de Término de la verificación"]
[null,null,{"$f":"IF(Resultados!$C$7=\"\",\"\",Resultados!$C$7)","v":"2021-07-07"},"2018-05-25",null,null,{"$f":"IF(Resultados!G7=\"\",\"\",Resultados!G7)","v":"2021-07-08"}]
[]
[null,null,"Criterios Sustantivos",null,{"$f":"IF(Aplicabilidad!G43<>\"SI\",\"NA\",(SUM(E19:E38)+SUM(E46:E67))/(SUM(D19:D38)+SUM(D46:D67)))","v":"NA"}]
[null,null,"Criterios Adjetivos",null,{"$f":"IF(Aplicabilidad!G43<>\"SI\",\"NA\",(SUM(E72:E80))/(SUM(D72:D80)))","v":"NA"}]
[null,null,"Obligación",null,{"$f":"IF(Aplicabilidad!G43<>\"SI\",\"NA\",E10*0.6+E11*0.4)","v":"NA"}]
[]
[]
[]
[null,null,"Criterios Sustantivos de contenido \nLTG 2018 - LTG 2020 (DOF 28/12/20) ",{"$f":"COUNTA(F19:F39)","v":0}]
[]
[null,null,"Criterio",null,"Valoración","Tipo","Observaciones, Recomendaciones y/o Requerimientos"]
[null,null,"Criterio 1. Ejercicio",{"$f":"IF(E19=\"Justificado\",0,1)","v":0},"Justificado"]
[null,null,"Criterio 2. Periodo que se informa",{"$f":"IF(E20=\"Justificado\",0,1)","v":0},"Justificado"]
[null,null,"Criterio 3. Personería jurídica del proveedor o contratista: Persona física/Persona moral",0,"Justificado"]
[null,null,"Criterio 4. Nombre (nombre[s], primer apellido, segundo apellido), denominación o razón social del proveedor o contratista",0,"Justificado"]
[null,null,"Criterio 5. Estratificación: Micro empresa/Pequeña empresa/Mediana empresa",0,"Justificado"]
[null,null,"Criterio 6. Origen del proveedor o contratista. Nacional/Internacional",0,"Justificado"]
[null,null,"Criterio 7. Entidad federativa (catálogo de entidades federativas) si la empresa es nacional",0,"Justificado"]
[null,null,"Criterio 8. País de origen si la empresa es una filial internacional",0,"Justificado"]
[null,null,"Criterio 9. Registro Federal de Contribuyentes (RFC) de la persona física o moral con homoclave incluida, emitido por el Servicio de Administración Tributaria (SAT). En el caso de personas morales son 12 caracteres y en el de personas físicas 13.",0,"Justificado"]
[null,null,"Criterio 10. El proveedor o contratista realiza subcontrataciones: Sí / No",0,"Justificado"]
[null,null,"Criterio 11. Giro de la empresa (catálogo). Especificar la actividad económica de la empresa usando como referencia la clasificación que se maneja en el Directorio Estadístico Nacional de Unidades Económicas (ej. Servicios Inmobiliarios y de alquiler de bienes muebles e intangibles, Servicios inmobiliarios, Alquiler de automóviles, camiones y otros trasportes terrestres; Alquiler de automóviles sin chofer)",0,"Justificado"]
[null,null,"Criterio 12. Domicilio fiscal de la empresa (tipo de vialidad [catálogo], nombre de vialidad [calle], número exterior, número interior [en su caso], Tipo de asentamiento humano [catálogo], nombre de asentamiento humano [colonia], clave de la localidad [catálogo], nombre de la localidad [catálogo], clave del municipio [catálogo], nombre del municipio o delegación [catálogo], clave de la entidad federativa [catálogo], nombre de la entidad federativa [catálogo], código postal), es decir, el proporcionado ante el SAT",0,"Justificado"]
[null,null,"Criterio 13. Nombre del representante legal de la empresa, es decir, la persona que posee facultades legales para representarla",0,"Justificado"]
[null,null,"Criterio 14. Datos de contacto: teléfono, en su caso extensión, y correo electrónico siempre y cuando éstos hayan sido proporcionados por la empresa",0,"Justificado"]
[null,null,"Criterio 15. Tipo de acreditación legal que posee o, en su caso, señalar que no se cuenta con uno",0,"Justificado"]
[null,null,"Criterio 16. Dirección electrónica que corresponda a la página web del proveedor o contratista",0,"Justificado"]
[null,null,"Criterio 17. Teléfono oficial del proveedor o contratista",0,"Justificado"]
[null,null,"Criterio 18. Correo electrónico comercial del proveedor o contratista",0,"Justificado"]
[null,null,"Criterio 19. Hipervínculo al registro electrónico de proveedores y contratistas que, en su caso, corresponda",{"$f":"IF(E37=\"Justificado\",0,1)","v":0},"Justificado"]
[null,null,"Criterio 20. Hipervínculo al Directorio de Proveedores y Contratistas Sancionados",{"$f":"IF(E38=\"Justificado\",0,1)","v":0},"Justificado"]
[]
[]
[]
[]
[null,null,"Criterios Sustantivos de contenido LTG 2018 - LTG 2020\n(DOF 28/12/20) ",{"$f":"COUNTA(F46:F80)","v":1}]
[]
[null,null,"Criterio",null,"Valoración","Tipo","Observaciones, Recomendaciones y/o Requerimientos"]
[null,null,"Criterio 1. Ejercicio",{"$f":"IF(E46=\"Justificado\",0,1)","v":1}]
[null,null,"Criterio 2. Periodo que se informa (fecha de inicio y fecha de término con el formato día/mes/año)",{"$f":"IF(E47=\"Justificado\",0,1)","v":1}]
[null,null,"Criterio 3. Personería jurídica del proveedor o contratista (catálogo): Persona física/Persona moral",1]
[null,null,"Criterio 4. Nombre (nombre[s], primer apellido, segundo apellido), denominación o razón social del proveedor o contratista",1]
[null,null,"Criterio 5. Estratificación, por ejemplo, Micro empresa, pequeña empresa, mediana empresa",1]
[null,null,"Criterio 6. Origen del proveedor o contratista (catálogo): Nacional/Extranjero",1]
[null,null,"Criterio 7. País de origen si la empresa es una filial extranjera",1]
[null,null,"Criterio 8. Registro Federal de Contribuyentes (RFC) de la persona física o moral con homoclave incluida, emitido por el Servicio de Administración Tributaria (SAT). En el caso de personas morales son 12 caracteres y en el de personas físicas 13.",1]
[null,null,"Criterio 9. Entidad federativa de la persona física o moral (catálogo)",1]
[null,null,"Criterio 10. El proveedor o contratista realiza subcontrataciones (catálogo): Sí / No",1]
[null,null,"Criterio 11. Actividad económica de la empresa. Especificar la actividad económica de la empresa usando como referencia la clasificación que se maneja en el Directorio Estadístico Nacional de Unidades Económicas. Por ejemplo: Servicios Inmobiliarios y de alquiler de bienes muebles e intangibles, Servicios inmobiliarios, Alquiler de automóviles, camiones y otros trasportes terrestres; Alquiler de automóviles sin chofer",1]
[null,null,"Criterio 12. Domicilio fiscal de la empresa (tipo de vialidad [catálogo], nombre de vialidad [calle], número exterior, número interior [en su caso], Tipo de asentamiento humano [catálogo], nombre de asentamiento humano [colonia], clave de la localidad, nombre de la localidad, clave del municipio, nombre del municipio o delegación, clave de la entidad federativa, nombre de la entidad federativa [catálogo], código postal), es decir, el proporcionado ante el SAT",1]
[null,null,"Criterio 13. Domicilio en el extranjero. En caso de que el proveedor o contratista sea de otro país, se deberá incluir el domicilio el cual deberá incluir por lo menos: país, ciudad, calle y número",1]
[null,null,"Criterio 14. Nombre del representante legal de la empresa, es decir, la persona que posee facultades legales para representarla",1]
[null,null,"Criterio 15. Datos de contacto: teléfono, en su caso extensión ",1]
[null,null,"Criterio 16. Correo electrónico, siempre y cuando éstos hayan sido proporcionados por la empresa",1]
[null,null,"Criterio 17. Tipo de acreditación legal que posee o, en su caso, señalar que no se cuenta con uno",1]
[null,null,"Criterio 18. Dirección electrónica que corresponda a la página web del proveedor o contratista",1]
[null,null,"Criterio 19. Teléfono oficial del proveedor o contratista",1]
[null,null,"Criterio 20. Correo electrónico comercial del proveedor o contratista",1]
[null,null,"Criterio 21. Hipervínculo al registro electrónico de proveedores y contratistas que, en su caso, corresponda",{"$f":"IF(E66=\"Justificado\",0,1)","v":1}]
[null,null,"Criterio 22. Hipervínculo al Directorio de Proveedores y Contratistas Sancionados",{"$f":"IF(E67=\"Justificado\",0,1)","v":1}]
[]
[null,null,"Criterios Adjetivos LTG 2018 - LTG 2020 (DOF 28/12/20) "]
[]
[null,null,"Criterio",null,"Valoración","Tipo","Observaciones, Recomendaciones y/o Requerimientos"]
[null,null,"Criterio 23. Periodo de actualización de la información: trimestral",{"$f":"IF(E72=\"Justificado\",0,1)","v":1}]
[null,null,"Criterio 24. La información deberá estar actualizada al periodo que corresponde, de acuerdo con la Tabla de actualización y conservación de la información",1]
[null,null,"Criterio 25. Conservar en el sitio de Internet: información del ejercicio en curso y la correspondiente al ejercicio inmediato anterior",1]
[null,null,"Criterio 26. Área(s) responsable(s) que genera(n), posee(n), publica(n) y/o actualiza(n) la información ",1]
[null,null,"Criterio 27. Fecha de actualización de la información publicada con el formato día/mes/año",1]
[null,null,"Criterio 28. Fecha de validación de la información publicada con el formato día/mes/año",1]
[null,null,"Criterio 29. Nota. Este criterio se cumple en caso de que sea necesario que el sujeto obligado incluya alguna aclaración relativa a la información publicada y/o explicación por la falta de información",1]
[null,null,"Criterio 30. La información publicada se organiza mediante el formato 32, en el que se incluyen todos los campos especificados en los criterios sustantivos de contenido",1]
[null,null,"Criterio 31. El soporte de la información permite su reutilización",1]
{"$rows_empty":7}
[{"$nulls":3},2017,2018]
[null,null,"CS",{"$f":"IF(Aplicabilidad!G43<>\"SI\",\"NA\",SUM(E19:E38)/SUM(D19:D38))","v":"NA"},{"$f":"IF(Aplicabilidad!G43<>\"SI\",\"NA\",SUM(E46:E67)/SUM(D46:D67))","v":"NA"}]
[null,null,"CA",{"$f":"IF(Aplicabilidad!G43<>\"SI\",\"NA\",SUM(#REF!)/SUM(#REF!))","v":"NA"},{"$f":"IF(Aplicabilidad!G43<>\"SI\",\"NA\",SUM(E72:E80)/SUM(D72:D80))","v":"NA"}]
[null,null,"OBLIGACIÓN",{"$f":"IF(Aplicabilidad!G43<>\"SI\",\"NA\",D89*0.6+D90*0.4)","v":"NA"},{"$f":"IF(Aplicabilidad!G43<>\"SI\",\"NA\",E89*0.6+E90*0.4)","v":"NA"}]

{"sheet":"Art 74_XXXIII","index":35,"n_rows":75,"n_cols":7,"rows_kept":75,"hidden":true,"merged":[[0,2,0,6],[4,1,4,7],[14,4,14,6],[33,4,33,6]]}
[null,null,{"$f":"IF(Aplicabilidad!E2=\"\",\"\",Aplicabilidad!E2)","v":"Consejería Jurídica"}]
[]
[null,"Códigos de valoración : Cumplió totalmente = 1; Cumplió parcialmente = 0.5; No cumplió = 0; Justificado = Justificado"]
[]
[null,"Art. 74 - Fracción XXXIII. Convenios con sectores social  y privado"]
[]
[null,null,"Fecha de Inicio de la Verificación:",{"$nulls":3},"Fecha de Término de la verificación"]
[null,null,{"$f":"IF(Resultados!$C$7=\"\",\"\",Resultados!$C$7)","v":"2021-07-07"},"2018-05-25",null,null,{"$f":"IF(Resultados!G7=\"\",\"\",Resultados!G7)","v":"2021-07-08"}]
[]
[null,null,"Criterios Sustantivos",null,{"$f":"IF(Aplicabilidad!G44<>\"SI\",\"NA\",(SUM(E19:E30)+SUM(E38:E51))/(SUM(D19:D30)+SUM(D38:D51)))","v":"NA"}]
[null,null,"Criterios Adjetivos",null,{"$f":"IF(Aplicabilidad!G44<>\"SI\",\"NA\",(SUM(E56:E64))/(SUM(D56:D64)))","v":"NA"}]
[null,null,"Obligación",null,{"$f":"IF(Aplicabilidad!G44<>\"SI\",\"NA\",E10*0.6+E11*0.4)","v":"NA"}]
[]
[]
[]
[null,null,"Criterios Sustantivos de contenido \nLTG 2018 - LTG 2020 (DOF 28/12/20) ",{"$f":"COUNTA(F19:F31)","v":0}]
[]
[null,null,"Criterio",null,"Valoración","Tipo","Observaciones, Recomendaciones y/o Requerimientos"]
[null,null,"Criterio 1. Ejercicio",{"$f":"IF(E19=\"Justificado\",0,1)","v":0},"Justificado"]
[null,null,"Criterio 2. Periodo que se informa",{"$f":"IF(E20=\"Justificado\",0,1)","v":0},"Justificado"]
[null,null,"Criterio 3. Tipo de convenio: De coordinación con el sector social/De coordinación con el sector privado/De concertación con el sector social/De concertación con el sector privado",0,"Justificado"]
[null,null,"Criterio 4. Fecha de firma del convenio con el formato día/mes/año (por ej. 31/Marzo/2016)",0,"Justificado"]
[null,null,"Criterio 5. Nombre de la unidad(es) administrativa(s) o áreas responsable(s) de dar seguimiento al convenio",0,"Justificado"]
[null,null,"Criterio 6. Con quién se celebra el convenio nombre(s), primer apellido, segundo apellido en caso de persona física; razón social si es persona moral",0,"Justificado"]
[null,null,"Criterio 7. Objetivo(s) del convenio",0,"Justificado"]
[null,null,"Criterio 8. Tipo y fuente de los recursos que se emplearán",0,"Justificado"]
[null,null,"Criterio 9. Vigencia del convenio: Inicio y término, ambos datos expresados en el formato día/mes/año (por ej. 31/Marzo/2016). En el caso de la fecha de término se considerará también la opción de registrar la palabra “abierta”, para aquellos casos en que la vigencia de un convenio no se especifique en su texto y, por ende tenga esta característica",0,"Justificado"]
[null,null,"Criterio 10. Fecha de publicación en el Diario Oficial de la Federación u otro medio homólogo con el formato día/mes/año (por ej. 31/Marzo/2016). Para los casos en que el convenio no hubiere sido publicado por un medio oficial, se contemplará la opción de registrar la leyenda “no publicado en medio oficial”",0,"Justificado"]
[null,null,"Criterio 11. Hipervínculo al documento, en su caso a la versión pública o al documento signado, si es que no existe la publicación en periódico oficial",{"$f":"IF(E29=\"Justificado\",0,1)","v":0},"Justificado"]
[null,null,"Criterio 12. Hipervínculo al documento con las modificaciones realizadas, en su caso",{"$f":"IF(E30=\"Justificado\",0,1)","v":0},"Justificado"]
[]
[]
[]
[]
[null,null,"Criterios Sustantivos de contenido \nLTG 2018 - LTG 2020 (DOF 28/12/20) ",{"$f":"COUNTA(F38:F64)","v":1}]
[]
[null,null,"Criterio",null,"Valoración","Tipo","Observaciones, Recomendaciones y/o Requerimientos"]
[null,null,"Criterio 1. Ejercicio",{"$f":"IF(E38=\"Justificado\",0,1)","v":1}]
[null,null,"Criterio 2. Periodo que se informa (fecha de inicio y fecha de término con el formato día/mes/año)",{"$f":"IF(E39=\"Justificado\",0,1)","v":1}]
[null,null,"Criterio 3. Tipo de convenio (catálogo): de coordinación con el sector social/de coordinación con el sector privado/de concertación con el sector social/de concertación con el sector privado",1]
[null,null,"Criterio 4. Denominación del convenio",1]
[null,null,"Criterio 5. Fecha de firma del convenio con el formato día/mes/año",1]
[null,null,"Criterio 6. Nombre del área(s) responsable(s) de dar seguimiento al convenio",1]
[null,null,"Criterio 7. Con quién se celebra el convenio nombre(s), primer apellido, segundo apellido en caso de persona física; razón social si es persona moral",1]
[null,null,"Criterio 8. Objetivo(s) del convenio",1]
[null,null,"Criterio 9. Fuente de los recursos que se emplearán",1]
[null,null,"Criterio 10. Descripción y/o monto de los recursos públicos entregados en efectivo, especie o donativos, en su caso ",1]
[null,null,"Criterio 11. Vigencia del convenio: Inicio y término, ambos datos expresados en el formato día/mes/año. En el caso de la fecha de término se considerará también la opción de registrar la palabra “abierta”, para aquellos casos en que la vigencia de un convenio no se especifique en su texto y, por ende, tenga esta característica",1]
[null,null,"Criterio 12. Fecha de publicación en el Diario Oficial de la Federación u otro medio homólogo con el formato día/mes/año. Para los casos en que el convenio no hubiere sido publicado por un medio oficial, se contemplará la opción de registrar una nota que señale que no fue publicado en medio oficial",1]
[null,null,"Criterio 13. Hipervínculo al documento, en su caso a la versión pública o al documento signado, si es que no existe la publicación en periódico oficial",{"$f":"IF(E50=\"Justificado\",0,1)","v":1}]
[null,null,"Criterio 14. Hipervínculo al documento con las modificaciones realizadas, en su caso",{"$f":"IF(E51=\"Justificado\",0,1)","v":1}]
[]
[null,null,"Criterios Adjetivos LTG 2018 - LTG 2020 (DOF 28/12/20) "]
[]
[null,null,"Criterio",null,"Valoración","Tipo","Observaciones, Recomendaciones y/o Requerimientos"]
[null,null,"Criterio 15. Periodo de actualización de la información: trimestral",{"$f":"IF(E56=\"Justificado\",0,1)","v":1}]
[null,null,"Criterio 16. La información deberá estar actualizada al periodo que corresponde, de acuerdo con la Tabla de actualización y conservación de la información",1]
[null,null,"Criterio 17. Conservar en el sitio de Internet y a través de la Plataforma Nacional la información de acuerdo con la Tabla de actualización y conservación de la información",1]
[null,null,"Criterio 18. Área(s) responsable(s) que genera(n), posee(n), publica(n) y/o actualiza(n) la información ",1]
[null,null,"Criterio 19. Fecha de actualización de la información publicada con el formato día/mes/año",1]
[null,null,"Criterio 20. Fecha de validación de la información publicada con el formato día/mes/año",1]
[null,null,"Criterio 21. Nota. Este criterio se cumple en caso de que sea necesario que el sujeto obligado incluya alguna aclaración relativa a la información publicada y/o explicación por la falta de información ",1]
[null,null,"Criterio 22. La información publicada se organiza mediante el formato 33, en el que se incluyen todos los campos especificados en los criterios sustantivos de contenido",1]
[null,null,"Criterio 23. El soporte de la información permite su reutilización",1]
{"$rows_empty":7}
[{"$nulls":3},2017,2018]
[null,null,"CS",{"$f":"IF(Aplicabilidad!G44<>\"SI\",\"NA\",SUM(E19:E30)/SUM(D19:D30))","v":"NA"},{"$f":"IF(Aplicabilidad!G44<>\"SI\",\"NA\",SUM(E38:E51)/SUM(D38:D51))","v":"NA"}]
[null,null,"CA",{"$f":"IF(Aplicabilidad!G44<>\"SI\",\"NA\",SUM(#REF!)/SUM(#REF!))","v":"NA"},{"$f":"IF(Aplicabilidad!G44<>\"SI\",\"NA\",SUM(E56:E64)/SUM(D56:D64))","v":"NA"}]
[null,null,"OBLIGACIÓN",{"$f":"IF(Aplicabilidad!G44<>\"SI\",\"NA\",D73*0.6+D74*0.4)","v":"NA"},{"$f":"IF(Aplicabilidad!G44<>\"SI\",\"NA\",E73*0.6+E74*0.4)","v":"NA"}]

{"sheet":"Art 74_XXXIV","index":36,"n_rows":144,"n_cols":7,"rows_kept":144,"merged":[[0,2,0,6],[4,1,4,7],[14,4,14,6],[57,4,57,6],[61,1,67,1],[68,1,74,1],[75,1,81,1],[82,1,96,1],[97,1,102,1],[103,1,108,1],[109,1,119,1]]}
[null,null,{"$f":"IF(Aplicabilidad!E2=\"\",\"\",Aplicabilidad!E2)","v":"Consejería Jurídica"}]
[]
[null,"Códigos de valoración : Cumplió totalmente = 1; Cumplió parcialmente = 0.5; No cumplió = 0; Justificado = Justificado"]
[]
[null,"Art. 74 - Fracción XXXIV. Inventario de bienes"]
[]
[null,null,"Fecha de Inicio de la Verificación:",{"$nulls":3},"Fecha de Término de la verificación"]
[null,null,{"$f":"IF(Resultados!$C$7=\"\",\"\",Resultados!$C$7)","v":"2021-07-07"},"2018-05-25",null,null,{"$f":"IF(Resultados!G7=\"\",\"\",Resultados!G7)","v":"2021-07-08"}]
[]
[null,null,"Criterios Sustantivos",null,{"$f":"IF(Aplicabilidad!G45<>\"SI\",\"NA\",(SUM(E19:E54)+SUM(E62:E120))/(SUM(D19:D54)+SUM(D62:D120)))","v":{"v":0.8333333333333334,"d":"83%"}}]
[null,null,"Criterios Adjetivos",null,{"$f":"IF(Aplicabilidad!G45<>\"SI\",\"NA\",(SUM(E125:E133))/(SUM(D125:D133)))","v":{"v":0.9444444444444444,"d":"94%"}}]
[null,null,"Obligación",null,{"$f":"IF(Aplicabilidad!G45<>\"SI\",\"NA\",E10*0.6+E11*0.4)","v":{"v":0.8777777777777778,"d":"87.78%"}}]
[]
[]
[]
[null,null,"Criterios Sustantivos de contenido \nLTG 2018 - LTG 2020 (DOF 28/12/20) ",{"$f":"COUNTA(F19:F55)","v":0}]
[]
[null,null,"Criterio",null,"Valoración","Tipo","Observaciones, Recomendaciones y/o Requerimientos"]
[null,null,"Criterio 1. Ejercicio",{"$f":"IF(E19=\"Justificado\",0,1)","v":0},"Justificado"]
[null,null,"Criterio 2. Periodo que se informa",{"$f":"IF(E20=\"Justificado\",0,1)","v":0},"Justificado"]
[null,null,"Criterio 3. Descripción del bien (incluir marca y modelo o, en su caso, señalar si corresponde a una pieza arqueológica, artística, histórica o de otra naturaleza)",0,"Justificado"]
[null,null,"Criterio 4. Código de identificación, en su caso",0,"Justificado"]
[null,null,"Criterio 5. Cantidad (total para cada uno de los bienes)",0,"Justificado"]
[null,null,"Criterio 6. Monto unitario del bien (precio de adquisición o valor contable)",0,"Justificado"]
[null,null,"Criterio 7. Monto por grupo de bienes",0,"Justificado"]
[null,null,"Criterio 8. Inventario semestral de altas practicadas a los bienes muebles especificando: descripción del bien, cantidad, causa de alta, fecha con el formato día/mes/año (por ej. 31/Marzo/2016) y valor del bien a la fecha de la alta",0,"Justificado"]
[null,null,"Criterio 9. Inventario semestral de bajas practicadas a los bienes muebles especificando: descripción del bien, cantidad, causa de baja, fecha con el formato día/mes/año (por ej. 31/Marzo/2016) y valor del bien a la fecha  de la baja",0,"Justificado"]
[null,null,"Criterio 10. Ejercicio",0,"Justificado"]
[null,null,"Criterio 11. Periodo que se informa",0,"Justificado"]
[null,null,"Criterio 12. Denominación del inmueble, en su caso",0,"Justificado"]
[null,null,"Criterio 13. Institución a cargo del inmueble",0,"Justificado"]
[null,null,"Criterio 14. Domicilio del inmueble (tipo de vialidad [catálogo], nombre de vialidad [calle], número exterior, número interior [en su caso], tipo de asentamiento humano [catálogo], nombre de asentamiento humano [colonia], clave de la localidad [catálogo], nombre de la localidad [catálogo], clave del municipio [catálogo], nombre del municipio o delegación [catálogo], clave de la entidad federativa [catálogo], nombre de la entidad federativa [catálogo], código postal)",0,"Justificado"]
[null,null,"Criterio 15. Naturaleza del inmueble: urbana o rústica (de conformidad con el artículo 66, fracción IV, del Reglamento del Registro Público de la Propiedad Federal)",0,"Justificado"]
[null,null,"Criterio 16. Carácter del monumento: arqueológico, histórico o artístico (para el caso de inmuebles que hayan sido declarados monumentos arqueológicos, históricos o artísticos",0,"Justificado"]
[null,null,"Criterio 17. Tipo de inmueble: edificación, terreno o mixto",0,"Justificado"]
[null,null,"Criterio 18. Uso del inmueble (especificar sólo aquéllos que son utilizados para fines religiosos)",0,"Justificado"]
[null,null,"Criterio 19. Operación que da origen a la propiedad o posesión del inmueble",0,"Justificado"]
[null,null,"Criterio 20. Valor catastral o último avalúo del inmueble",0,"Justificado"]
[null,null,"Criterio 21. Título por el cual se acredite la propiedad o posesión del inmueble por parte del Gobierno Federal, las entidades federativas o los municipios, a la fecha de actualización de la información",0,"Justificado"]
[null,null,"Criterio 22. Hipervínculo al Sistema de Información Inmobiliaria Federal y Paraestatal u homólogo de cada entidad federativa",0,"Justificado"]
[null,null,"Criterio 23. Unidad administrativa de adscripción (Área) del servidor público /o toda persona que desempeñe un empleo, cargo o comisión y/o ejerza actos de autoridad (de acuerdo con el catálogo de unidades administrativas o puestos que funge como responsable inmobiliario)",0,"Justificado"]
[null,null,"Criterio 24. Inventario semestral de altas practicadas a los bienes inmuebles especificando: descripción del bien, causa de alta, fecha con el formato día/mes/año (por ej. 31/Marzo/2016) y valor del bien a la fecha del alta",0,"Justificado"]
[null,null,"Criterio 25. Inventario semestral de bajas practicadas a los bienes inmuebles especificando: descripción del bien, causa de baja, fecha con el formato día/mes/año (por ej. 31/Marzo/2016) y valor del inmueble a la fecha de la baja",0,"Justificado"]
[null,null,"Criterio 26. Ejercicio",0,"Justificado"]
[null,null,"Criterio 27. Periodo que se informa",0,"Justificado"]
[null,null,"Criterio 28. Descripción del bien",0,"Justificado"]
[null,null,"Criterio 29. Actividades a las que se destinará el bien donado: educativas, culturales, de salud, de investigación científica, de aplicación de nuevas tecnologías, de beneficencia, prestación de servicios sociales, ayuda humanitaria, otra (especificar)",0,"Justificado"]
[null,null,"Criterio 30. Personería jurídica del donatario: Persona física/Persona moral",0,"Justificado"]
[null,null,"Criterio 31. En caso de persona física: Nombre (nombre[s], primer apellido, segundo apellido)",0,"Justificado"]
[null,null,"Criterio 32. En caso de persona moral, especificar tipo: Entidad federativa/Municipio/Institución de salud/Beneficencia o asistencia/Educativa//Cultural/Prestadores de servicios sociales por encargo/Beneficiarios de algún servicio asistencial público/Comunidad agraria y ejido/Entidad que lo necesite para sus fines/Gobierno o institución extranjera/Organización internacional/Otro (especificar)",0,"Justificado"]
[null,null,"Criterio 33. Denominación o razón social del donatario",0,"Justificado"]
[null,null,"Criterio 34. Valor de adquisición o valor de inventario del bien donado",0,"Justificado"]
[null,null,"Criterio 35. Fecha de firma del contrato de donación, signado por la autoridad pública o representante legal de la institución donante, así como por el donatario. En su caso, la fecha de publicación del Acuerdo presidencial en el DOF con el formato día/mes/año (por ej. 31/Marzo/2016)",{"$f":"IF(E53=\"Justificado\",0,1)","v":0},"Justificado"]
[null,null,"Criterio 36. Hipervínculo al Acuerdo presidencial respectivo, en el caso de donaciones a gobiernos e instituciones extranjeros o a organizaciones internacionales para ayuda humanitaria o investigación científica",{"$f":"IF(E54=\"Justificado\",0,1)","v":0},"Justificado"]
[]
[]
[]
[]
[null,null,"Criterios Sustantivos de contenido\n LTG 2018 - LTG 2020 (DOF 28/12/20) ",{"$f":"COUNTA(F62:F133)","v":13}]
[]
[null,null,"Criterio",null,"Valoración","Tipo","Observaciones, Recomendaciones y/o Requerimientos"]
[null,"Formato 34a","Respecto de los bienes muebles se publicará:\nCriterio 1. Ejercicio",{"$f":"IF(E62=\"Justificado\",0,1)","v":1},1]
[null,null,"Criterio 2. Periodo que se informa (fecha de inicio y fecha de término con el formato día/mes/año)",{"$f":"IF(E63=\"Justificado\",0,1)","v":1},1]
[null,null,"Criterio 3. Descripción del bien (incluir marca y modelo o, en su caso, señalar si corresponde a una pieza arqueológica, artística, histórica o de otra naturaleza)",1,1]
[null,null,"Criterio 4. Código de identificación, en su caso",1,1]
[null,null,"Criterio 5. Institución a cargo del bien mueble, en su caso",1,1]
[null,null,"Criterio 6. Número de inventario",1,1]
[null,null,"Criterio 7. Monto unitario del bien (precio de adquisición o valor contable)",1,1]
[null,"Formato 34b","Inventario semestral de altas practicadas a los bienes muebles especificando:\nCriterio 8. Ejercicio ",1,1]
[null,null,"Criterio 9 . Periodo que se informa (fecha de inicio y fecha de término con el formato día/mes/año)",1,1]
[null,null,"Criterio 10. Descripción del bien",1,1]
[null,null,"Criterio 11. Número de inventario ",1,1]
[null,null,"Criterio 12. Causa de alta",1,1]
[null,null,"Criterio 13. Fecha con el formato día/mes/año ",1,1]
[null,null,"Criterio 14. Valor del bien a la fecha  del alta",1,1]
[null,"Formato 34c","Inventario semestral de bajas practicadas a los bienes muebles especificando:\nCriterio 15. Ejercicio ",1,1]
[null,null,"Criterio 16 . Periodo que se informa (fecha de inicio y fecha de término con el formato día/mes/año)",1,1]
[null,null,"Criterio 17. Descripción del bien",0,"Justificado"]
[null,null,"Criterio 18. Número de inventario",0,"Justificado"]
[null,null,"Criterio 19. Causa de baja",0,"Justificado"]
[null,null,"Criterio 20. Fecha de baja con el formato día/mes/año",0,"Justificado"]
[null,null,"Criterio 21. Valor del bien a la fecha de la baja",0,"Justificado"]
[null,"Formato 34d","Los datos correspondientes a los bienes inmuebles son:\nCriterio 22. Ejercicio",1,1]
[null,null,"Criterio 23. Periodo que se informa (fecha de inicio y fecha de término con el formato día/mes/año)",1,1]
[null,null,"Criterio 24. Denominación del inmueble, en su caso",0,"Justificado"]
[null,null,"Criterio 25. Institución a cargo del inmueble",0,"Justificado"]
[null,null,"Criterio 26. Domicilio del inmueble (tipo de vialidad [catálogo], nombre de vialidad [calle], número exterior, número interior [en su caso], tipo de asentamiento humano [catálogo], nombre de asentamiento humano [colonia], clave de la localidad, nombre de la localidad, clave del municipio, nombre del municipio o delegación, clave de la entidad federativa, nombre de la entidad federativa [catálogo], código postal)",0,"Justificado"]
[null,null,"Criterio 27. Domicilio en el extranjero. En caso de que el inmueble se ubique en otro país, se deberá incluir el domicilio el cual deberá incluir por lo menos: país, ciudad, calle y número",0,"Justificado"]
[null,null,"Criterio 28. Naturaleza del inmueble (catálogo): Urbana/Rústica (de conformidad con el artículo 66, fracción IV, del Reglamento del Registro Público de la Propiedad Federal)",0,"Justificado"]
[null,null,"Criterio 29. Carácter del monumento (catálogo): Arqueológico/Histórico/Artístico (para el caso de inmuebles que hayan sido declarados monumentos arqueológicos, históricos o artísticos",0,"Justificado"]
[null,null,"Criterio 30. Tipo de inmueble (catálogo): edificación/terreno/mixto",0,"Justificado"]
[null,null,"Criterio 31. Uso del inmueble ",0,"Justificado"]
[null,null,"Criterio 32. Operación que da origen a la propiedad o posesión del inmueble",0,"Justificado"]
[null,null,"Criterio 33. Valor catastral o último avalúo del inmueble",0,"Justificado"]
[null,null,"Criterio 34. Título por el cual se acredite la propiedad o posesión del inmueble por parte del Gobierno Federal, las entidades federativas o los municipios, a la fecha de actualización de la información",0,"Justificado"]
[null,null,"Criterio 35. Hipervínculo al Sistema de Información Inmobiliaria Federal y Paraestatal u homólogo de cada entidad federativa",0,"Justificado"]
[null,null,"Criterio 36. Área de adscripción del servidor público /o toda persona que desempeñe un empleo, cargo o comisión y/o ejerza actos de autoridad (de acuerdo con el catálogo de áreas o puestos que funge como responsable inmobiliario)",0,"Justificado"]
[null,"Formato 34e","Inventario semestral de altas practicadas a los bienes inmuebles especificando:\nCriterio 37. Ejercicio ",1,1]
[null,null,"Criterio 38. Periodo que se informa (fecha de inicio y fecha de término con el formato día/mes/año)",1,1]
[null,null,"Criterio 39. Descripción del bien",0,"Justificado"]
[null,null,"Criterio 40. Causa de alta",0,"Justificado"]
[null,null,"Criterio 41. Fecha de alta con el formato día/mes/año ",0,"Justificado"]
[null,null,"Criterio 42. Valor del bien a la fecha del alta",0,"Justificado"]
[null,"Formato 34f","Inventario semestral de bajas practicadas a los bienes inmuebles especificando:\nCriterio 43. Ejercicio ",1,1]
[null,null,"Criterio 44 . Periodo que se informa (fecha de inicio y fecha de término con el formato día/mes/año)",1,1]
[null,null,"Criterio 45. Descripción del bien",0,"Justificado"]
[null,null,"Criterio 46. Causa de baja",0,"Justificado"]
[null,null,"Criterio 47. Fecha de baja con el formato día/mes/año",0,"Justificado"]
[null,null,"Criterio 48. Valor del inmueble a la fecha de la baja",0,"Justificado"]
[null,"Formato 34g","La información respecto de los bienes muebles e inmuebles donados al sujeto obligado es la siguiente: Párrafo modificado DOF 28/12/2020\nCriterio 49. Ejercicio",1,0.5,"Requerimiento","Por incumplimiento a lo señalado en el criterio adjetivo 61."]
[null,null,"Criterio 50. Periodo que se informa (fecha de inicio y fecha de término con el formato día/mes/año)",1,0.5,"Requerimiento","Por incumplimiento a lo señalado en el criterio adjetivo 61."]
[null,null,"Criterio 51. Descripción del bien",1,0.5,"Requerimiento","Por incumplimiento a lo señalado en el criterio adjetivo 61."]
[null,null,"Criterio 52. Actividades a las que se destinará el bien donado (catálogo): Educativas/Culturales/De salud/De investigación científica/De aplicación de nuevas tecnologías/De beneficencia/Prestación de servicios sociales/Ayuda humanitaria/Otra",1,0.5,"Requerimiento","Por incumplimiento a lo señalado en el criterio adjetivo 61."]
[null,null,"Criterio 53. Personería jurídica del donante (catálogo): Persona física/Persona moral - Criterio modificado DOF 28/12/2020",1,0.5,"Requerimiento","Por incumplimiento a lo señalado en el criterio adjetivo 61."]
[null,null,"Criterio 54. En caso de persona física: Nombre (nombre[s], primer apellido, segundo apellido)",1,0.5,"Requerimiento","Por incumplimiento a lo señalado en el criterio adjetivo 61."]
[null,null,"Criterio 55. Tipo de persona moral, en su caso. Por ejemplo: Entidad federativa, Municipio, Institución de salud, Beneficencia o asistencia, Educativa, Cultural, Prestadores de servicios sociales por encargo, Beneficiarios de algún servicio asistencial público, Comunidad agraria y ejido, Entidad que lo necesite para sus fines, Gobierno o institución extranjera, Organización internacional",1,0.5,"Requerimiento","Por incumplimiento a lo señalado en el criterio adjetivo 61."]
[null,null,"Criterio 56. Denominación o razón social del donante\nCriterio modificado DOF 28/12/2020",1,0.5,"Requerimiento","Por incumplimiento a lo señalado en el criterio adjetivo 61."]
[null,null,"Criterio 57. Valor de adquisición o valor de inventario del bien donado",1,0.5,"Requerimiento","Por incumplimiento a lo señalado en el criterio adjetivo 61."]
[null,null,"Criterio 58. Fecha de firma del contrato de donación, signado por la autoridad pública o representante legal de la institución donante, así como por el donatario. En su caso, la fecha de publicación del Acuerdo presidencial en el DOF con el formato día/mes/año ",{"$f":"IF(E119=\"Justificado\",0,1)","v":1},0.5,"Requerimiento","Por incumplimiento a lo señalado en el criterio adjetivo 61."]
[null,null,"Criterio 59. Hipervínculo al Acuerdo presidencial respectivo, en el caso de donaciones a gobiernos e instituciones extranjeros o a organizaciones internacionales para ayuda humanitaria o investigación científica",{"$f":"IF(E120=\"Justificado\",0,1)","v":1},0.5,"Requerimiento","Por incumplimiento a lo señalado en el criterio adjetivo 61."]
[]
[null,null,"Criterios Adjetivos LTG 2018 - LTG 2020 (DOF 28/12/20) "]
[]
[null,null,"Criterio",null,"Valoración","Tipo","Observaciones, Recomendaciones y/o Requerimientos"]
[null,null,"Criterio 60. Periodo de actualización de la información: semestral; en su caso, 30 días hábiles después de adquirir o dar de baja algún bien",{"$f":"IF(E125=\"Justificado\",0,1)","v":1},1]
[null,null,"Criterio 61. La información deberá estar actualizada al periodo que corresponde de acuerdo con la Tabla de actualización y conservación de la información",1,0.5,"Requerimiento","De conformidad con los Lineamientos Técnicos Generales deberá publicar la información del segundo semestre del ejercicio 2020 en el formato 34-G bienes donados."]
[null,null,"Criterio 62. Conservar en el sitio de Internet: información vigente respecto al inventario de bienes muebles e inmuebles.\nEn cuanto al inventario de altas y bajas, así como los bienes muebles e inmuebles donados, se conservará la información vigente y la correspondiente al semestre anterior concluido",1,1]
[null,null,"Criterio 63. Área(s) responsable(s) que genera(n), posee(n), publica(n) y/o actualiza(n) la información  ",1,1]
[null,null,"Criterio 64. Fecha de actualización de la información publicada con el formato día/mes/año",1,1]
[null,null,"Criterio 65. Fecha de validación de la información publicada con el formato día/mes/año",1,1]
[null,null,"Criterio 66. Nota. Este criterio se cumple en caso de que sea necesario que el sujeto obligado incluya alguna aclaración relativa a la información publicada y/o explicación por la falta de información ",1,1]
[null,null,"Criterio 67. La información publicada se organiza mediante los formatos 34a al 34g, en los que se incluyen todos los campos especificados en los criterios sustantivos de contenido",1,1]
[null,null,"Criterio 68. El soporte de la información permite su reutilización",1,1]
{"$rows_empty":7}
[{"$nulls":3},2017,2018]
[null,null,"CS",{"$f":"IF(Aplicabilidad!G45<>\"SI\",\"NA\",SUM(E19:E54)/SUM(D19:D54))","v":{"$error":"#DIV/0!"}},{"$f":"IF(Aplicabilidad!G45<>\"SI\",\"NA\",SUM(E62:E120)/SUM(D62:D120))","v":{"v":0.8333333333333334,"d":"83.33%"}}]
[null,null,"CA",{"$f":"IF(Aplicabilidad!G45<>\"SI\",\"NA\",SUM(#REF!)/SUM(#REF!))","v":{"$error":"#REF!"}},{"$f":"IF(Aplicabilidad!G45<>\"SI\",\"NA\",SUM(E125:E133)/SUM(D125:D133))","v":{"v":0.9444444444444444,"d":"94.44%"}}]
[null,null,"OBLIGACIÓN",{"$f":"IF(Aplicabilidad!G45<>\"SI\",\"NA\",D142*0.6+D143*0.4)","v":{"$error":"#DIV/0!"}},{"$f":"IF(Aplicabilidad!G45<>\"SI\",\"NA\",E142*0.6+E143*0.4)","v":{"v":0.8777777777777778,"d":"87.78%"}}]

{"sheet":"Art 74_XXXV","index":37,"n_rows":151,"n_cols":7,"rows_kept":151,"hidden":true,"merged":[[0,2,0,6],[4,1,4,7],[14,4,14,6],[72,4,72,6]]}
[null,null,{"$f":"IF(Aplicabilidad!E2=\"\",\"\",Aplicabilidad!E2)","v":"Consejería Jurídica"}]
[]
[null,"Códigos de valoración : Cumplió totalmente = 1; Cumplió parcialmente = 0.5; No cumplió = 0; Justificado = Justificado"]
[]
[null,"Art. 74 - Fracción XXXV. Recomendaciones  y su atención en materia de derechos humanos"]
[]
[null,null,"Fecha de Inicio de la Verificación:",{"$nulls":3},"Fecha de Término de la verificación"]
[null,null,{"$f":"IF(Resultados!$C$7=\"\",\"\",Resultados!$C$7)","v":"2021-07-07"},"2018-05-25",null,null,{"$f":"IF(Resultados!G7=\"\",\"\",Resultados!G7)","v":"2021-07-08"}]
[]
[null,null,"Criterios Sustantivos",null,{"$f":"IF(Aplicabilidad!G46<>\"SI\",\"NA\",(SUM(E19:E69)+SUM(E77:E127))/(SUM(D19:D69)+SUM(D77:D127)))","v":"NA"}]
[null,null,"Criterios Adjetivos",null,{"$f":"IF(Aplicabilidad!G46<>\"SI\",\"NA\",(SUM(E132:E140))/(SUM(D132:D140)))","v":"NA"}]
[null,null,"Obligación",null,{"$f":"IF(Aplicabilidad!G46<>\"SI\",\"NA\",E10*0.6+E11*0.4)","v":"NA"}]
[]
[]
[]
[null,null,"Criterios Sustantivos de contenido \nLTG 2018 - LTG 2020 (DOF 28/12/20) ",{"$f":"COUNTA(F19:F70)","v":0}]
[]
[null,null,"Criterio",null,"Valoración","Tipo","Observaciones, Recomendaciones y/o Requerimientos"]
[null,null,"Criterio 1. Ejercicio",{"$f":"IF(E19=\"Justificado\",0,1)","v":0},"Justificado"]
[null,null,"Criterio 2. Periodo que se informa",{"$f":"IF(E20=\"Justificado\",0,1)","v":0},"Justificado"]
[null,null,"Criterio 3. Fecha en la que se recibió la notificación de la recomendación con el formato día/mes/año (por ej. 31/Marzo/2016)",0,"Justificado"]
[null,null,"Criterio 4. Número de recomendación",0,"Justificado"]
[null,null,"Criterio 5. Hecho violatorio (motivo de la recomendación)",0,"Justificado"]
[null,null,"Criterio 6. Tipo de recomendación: Recomendación específica/Recomendación general/Recomendación por violaciones graves/Otro tipo (especificar)",0,"Justificado"]
[null,null,"Criterio 7. Número(s) de expediente(s) y/o quejas cuando así aplique",0,"Justificado"]
[null,null,"Criterio 8. Fecha de solicitud, en su caso, de la opinión no vinculatoria por parte del sujeto obligado a la Unidad responsable para determinar la aceptación o no de la recomendación. La fecha se registrará con el formato día/mes/año (por ej. 31/Marzo/2016)",0,"Justificado"]
[null,null,"Criterio 9. Fecha en la que se recibe la opinión emitida por la Unidad responsable con el formato día/mes/año (por ej. 31/Marzo/2016)",0,"Justificado"]
[null,null,"Criterio 10. Estatus de la recomendación: Aceptada/Rechazada",0,"Justificado"]
[null,null,"Criterio 11. Número de oficio, documento o medio oficial mediante el cual se notifica la aceptación o no de la recomendación",0,"Justificado"]
[null,null,"Criterio 12. Hipervínculo al documento (versión pública) de la recomendación",0,"Justificado"]
[null,null,"Criterio 13. Cuando así corresponda, se incluirá la fecha en la cual se solicitó la opinión de la Unidad responsable sobre las acciones y forma de reparar el daño con el formato día/mes/año (por ej. 31/Marzo/2016)",0,"Justificado"]
[null,null,"Criterio 14. Fecha de respuesta de la Unidad responsable con el formato día/mes/año (por ej. 31/Marzo/2016)",0,"Justificado"]
[null,null,"Criterio 15. Acciones realizadas por el sujeto obligado para dar cumplimiento a cada uno de los puntos recomendatorios",0,"Justificado"]
[null,null,"Criterio 16. Dependencias y Entidades Federativas que hayan colaborado para dar cumplimiento a la Recomendación, en su caso",0,"Justificado"]
[null,null,"Criterio 17. Fecha de notificación a la CNDH o al organismo estatal, respecto del cumplimiento dado a cada punto recomendatorio, con el formato día/mes/año (por ej. 31/Marzo/2016)",0,"Justificado"]
[null,null,"Criterio 18. Hipervínculo a la sección del sitio de Internet de la CNDH o del organismos estatal correspondiente, en donde se publique la información de las Recomendaciones",0,"Justificado"]
[null,null,"Criterio 19. Razón de la negativa (motivos y fundamentos)",0,"Justificado"]
[null,null,"Criterio 20. De ser el caso, fecha de comparecencia ante la Cámara de Senadores o en sus recesos, ante la Comisión Permanente, o a las legislaturas de las Entidades Federativas, según corresponda, con el formato día/mes/año (por ej. 31/Marzo/2016)",0,"Justificado"]
[null,null,"Criterio 21. Nombre(s) de los (las) servidores(as) públicos(as), integrantes, miembros del sujeto obligado y/o toda persona que desempeñe un empleo, cargo o comisión y/o ejerza actos de autoridad encargado de comparecer para explicar el motivo de la negativa a las recomendaciones (nombre[s], primer apellido, segundo apellido)",0,"Justificado"]
[null,null,"Criterio 22. Hipervínculo a la minuta de la comparecencia, en su caso",0,"Justificado"]
[null,null,"Criterio 23. Determinación o respuesta de la CNDH u organismos públicos locales, previa consulta con los órganos legislativos, ante la negativa de la autoridad responsable",0,"Justificado"]
[null,null,"Criterio 24. Fecha de notificación, al sujeto obligado, de la determinación de la CNDH u organismo público local, con el formato día/mes/año (por ej. 31/Marzo/2016)",0,"Justificado"]
[null,null,"Criterio 25. Hipervínculo al oficio, documento oficial o medio por el cual se notifica la determinación de la CNDH",0,"Justificado"]
[null,null,"Criterio 26 . Respuesta notificada a la CNDH o al organismo local respecto de la determinación (persistencia en la negativa de la recomendación o determinación de cumplir con ella)",0,"Justificado"]
[null,null,"Criterio 27. Fecha en la que se notifica la respuesta (criterio que antecede), con el formato día/mes/año (por ej. 31/Marzo/2016)",0,"Justificado"]
[null,null,"Criterio 28. Número de oficio, documento oficial o medio por el cual se notifica la respuesta a la CNDH",0,"Justificado"]
[null,null,"Criterio 29. Número de denuncia ante el Ministerio Público o la autoridad administrativa competente",0,"Justificado"]
[null,null,"Criterio 30. Estado de las recomendaciones aceptadas: con pruebas de cumplimiento total/con pruebas de cumplimiento parcial/sin pruebas de cumplimiento/con cumplimiento insatisfactorio/en tiempo para presentar pruebas de cumplimiento/en tiempo de ser contestadas/cuyo cumplimiento reviste características peculiares",0,"Justificado"]
[null,null,"Criterio 31. Si la Recomendación se encuentra concluida, se publicará la fecha de conclusión del expediente con el formato día/mes/año (por ej. 31/Marzo/2016)",0,"Justificado"]
[null,null,"Criterio 32. Fecha de notificación de la conclusión con el formato día/mes/año (por ej. 31/Marzo/2016)",0,"Justificado"]
[null,null,"Criterio 33. Hipervínculo a la versión publica del Sistema de Seguimiento a Recomendaciones emitidas por la CNDH (SISER) y/o sistemas homólogos",0,"Justificado"]
[null,null,"Criterio 34 . Ejercicio",0,"Justificado"]
[null,null,"Criterio 35. Periodo que se informa",0,"Justificado"]
[null,null,"Criterio 36. Caso del que trata la recomendación",0,"Justificado"]
[null,null,"Criterio 37. Fecha en la que se recibió la notificación de la recomendación con el formato día/mes/año (por ej. 31/Marzo/2016)",0,"Justificado"]
[null,null,"Criterio 38 . Número de recomendación",0,"Justificado"]
[null,null,"Criterio 39. Hipervínculo al sitio de Internet de la CNDH, concretamente, a la sección en la que se publican los Casos especiales. En su caso, al sitio de Internet de los organismos estatales en donde se publique la información en comento",0,"Justificado"]
[null,null,"Criterio 40. Hipervínculo al buscador de recomendaciones internacionales a México en materia de derechos humanos",0,"Justificado"]
[null,null,"Criterio 41. Ejercicio",0,"Justificado"]
[null,null,"Criterio 42. Periodo que se informa",0,"Justificado"]
[null,null,"Criterio 43. Fecha en la que se emitió la información con el formato día/mes/año (por ej. 31/Marzo/2016)",0,"Justificado"]
[null,null,"Criterio 44. Nombre del caso",0,"Justificado"]
[null,null,"Criterio 45. Derecho(s) humano(s) violado(s)",0,"Justificado"]
[null,null,"Criterio 46. Víctima(s)",0,"Justificado"]
[null,null,"Criterio 47. Órgano emisor de conformidad con el siguiente catálogo:\nSistema Universal de Derechos Humanos\nÓrganos creados en virtud de tratados: Comité contra las Desapariciones Forzadas/Comité de los Derechos Económicos, Sociales y Culturales/Comité de los Derechos del Niño/Comité de los Derechos Humanos/Comité para la Eliminación de la Discriminación Racial/Comité contra la Tortura/Comité para la Eliminación de la Discriminación contra la Mujer/Comité de la Protección de los Derechos de Todos los Trabajadores Migratorios y de sus Familiares/Subcomité para la Prevención de la Tortura\nProcedimientos especiales: Grupo de Trabajo sobre Desapariciones Forzadas7Grupo de Trabajo sobre la Detención Arbitraria/Relator Especial contra la Tortura/Relator Especial sobre la venta de niños, la prostitución infantil y la utilización de niños en la pornografía/Relator especial sobre los efectos nocivos para el goce de los derechos humanos del traslado y vertimiento ilícitos de productos y desechos tóxicos y peligrosos/Relator Especial sobre Ejecuciones Extrajudiciales, Sumarias o Arbitrarias/Relator Especial sobre la independencia de los magistrados y abogados/Relator Especial sobre los Derechos Humanos de los Migrantes/Relator Especial sobre una vivienda adecuada como parte del derecho a un nivel de vida adecuado, y sobre el derecho a la no discriminación/Representante del Secretario General sobre los desplazados internos/Relator Especial sobre la situación de los derechos humanos y las libertades fundamentales de los indígenas/Relator Especial sobre la violencia contra la mujer, sus causas y consecuencias/Relator Especial sobre el derecho a la Educación/Relator Especial sobre el derecho a la Libertad de Expresión/Relator Especial sobre el derecho a la Alimentación u otros órganos\nSistema de casos y peticiones: Comisión Interamericana de Derechos Humanos/Corte Interamericana de Derechos Humanos\nSistema Interamericano de Derechos Humanos\nOtros mecanismos\nRelatoría Especial sobre los derechos de los Trabajadores Migratorios y Miembros de sus Familias/Relatoría Especial sobre la Libertad de Expresión/Relatoría Especial sobre Asuntos de la Mujer/Relatoría sobre los Derechos de las Personas Privadas de Libertad/Relatoría sobre los Derechos de las Personas Lesbianas, Gays, Bisexuales, Trans e Intersex/Relatoría sobre los Derechos de las Personas Afro-descendientes/Relatoría sobre los Derechos de los Pueblos Indígenas/Relatoría sobre Defensores y Defensoras de Derechos Humanos/Relatoría sobre los Derechos de la Niñez/Otro (especificar)",0,"Justificado"]
[null,null,"Criterio 48. Fundamentos del caso",0,"Justificado"]
[null,null,"Criterio 49. Etapa en la que se encuentra",0,"Justificado"]
[null,null,"Criterio 50. Hipervínculo al informe, sentencia, resolución y/ o recomendación",{"$f":"IF(E68=\"Justificado\",0,1)","v":0},"Justificado"]
[null,null,"Criterio 51. Hipervínculo a la Ficha técnica completa",{"$f":"IF(E69=\"Justificado\",0,1)","v":0},"Justificado"]
[]
[]
[]
[]
[null,null,"Criterios Sustantivos de contenido LTG 2018 - LTG 2020 (DOF 28/12/20) ",{"$f":"COUNTA(F77:F140)","v":1}]
[]
[null,null,"Criterio",null,"Valoración","Tipo","Observaciones, Recomendaciones y/o Requerimientos"]
[null,null,"Criterio 1. Ejercicio",{"$f":"IF(E77=\"Justificado\",0,1)","v":1}]
[null,null,"Criterio 2. Periodo que se informa (fecha de inicio y fecha de término con el formato día/mes/año)",{"$f":"IF(E78=\"Justificado\",0,1)","v":1}]
[null,null,"Criterio 3. Fecha en la que se recibió la notificación de la recomendación con el formato día/mes/año ",1]
[null,null,"Criterio 4. Número de recomendación",1]
[null,null,"Criterio 5. Hecho violatorio (motivo de la recomendación)",1]
[null,null,"Criterio 6. Tipo de recomendación (catálogo): Recomendación específica/Recomendación general/Recomendación por violaciones graves/Otro tipo",1]
[null,null,"Criterio 7. Número(s) de expediente(s) y/o quejas cuando así aplique",1]
[null,null,"Criterio 8. Fecha de solicitud, en su caso, de la opinión no vinculatoria por parte del sujeto obligado a la Unidad responsable para determinar la aceptación o no de la recomendación. La fecha se registrará con el formato día/mes/año ",1]
[null,null,"Criterio 9. Fecha en la que se recibe la opinión emitida por la Unidad responsable con el formato día/mes/año ",1]
[null,null,"Criterio 10. Estatus de la recomendación (catálogo): Aceptada/Rechazada",1]
[null,null,"Criterio 11. Número de oficio, documento o medio oficial mediante el cual se notifica la aceptación o no de la recomendación",1]
[null,null,"Criterio 12. Hipervínculo al documento (versión pública) de la recomendación",1]
[null,null,"Criterio 13. Cuando así corresponda, se incluirá la fecha en la cual se solicitó la opinión de la Unidad responsable sobre las acciones y forma de reparar el daño con el formato día/mes/año ",1]
[null,null,"Criterio 14. Fecha de respuesta de la Unidad responsable con el formato día/mes/año ",1]
[null,null,"Criterio 15. Acciones realizadas por el sujeto obligado para dar cumplimiento a cada uno de los puntos recomendatorios",1]
[null,null,"Criterio 16. Dependencias y Entidades Federativas que hayan colaborado para dar cumplimiento a la Recomendación, en su caso",1]
[null,null,"Criterio 17. Fecha de notificación a la CNDH o al organismo estatal, respecto del cumplimiento dado a cada punto recomendatorio, con el formato día/mes/año ",1]
[null,null,"Criterio 18. Hipervínculo a la sección del sitio de Internet de la CNDH o del organismos estatal correspondiente, en donde se publique la información de las Recomendaciones",1]
[null,null,"Criterio 19. Razón de la negativa (motivos y fundamentos)",1]
[null,null,"Criterio 20. De ser el caso, fecha de comparecencia ante la Cámara de Senadores o en sus recesos, ante la Comisión Permanente, o a las legislaturas de las Entidades Federativas, según corresponda, con el formato día/mes/año ",1]
[null,null,"Criterio 21. Nombre(s) de los (las) servidores(as) públicos(as), integrantes, miembros del sujeto obligado y/o toda persona que desempeñe un empleo, cargo o comisión y/o ejerza actos de autoridad encargado de comparecer para explicar el motivo de la negativa a las recomendaciones (nombre[s], primer apellido, segundo apellido)",1]
[null,null,"Criterio 22. Hipervínculo a la minuta de la comparecencia, en su caso",1]
[null,null,"Criterio 23. Determinación o respuesta de la CNDH u organismos públicos locales, previa consulta con los órganos legislativos, ante la negativa de la autoridad responsable",1]
[null,null,"Criterio 24. Fecha de notificación, al sujeto obligado, de la determinación de la CNDH u organismo público local, con el formato día/mes/año ",1]
[null,null,"Criterio 25. Hipervínculo al oficio, documento oficial o medio por el cual se notifica la determinación de la CNDH",1]
[null,null,"Criterio 26. Respuesta notificada a la CNDH o al organismo local respecto de la determinación (persistencia en la negativa de la recomendación o determinación de cumplir con ella)",1]
[null,null,"Criterio 27. Fecha en la que se notifica la respuesta (criterio que antecede), con el formato día/mes/año",1]
[null,null,"Criterio 28. Número de oficio, documento oficial o medio por el cual se notifica la respuesta a la CNDH",1]
[null,null,"Criterio 29. Número de denuncia ante el Ministerio Público o la autoridad administrativa competente",1]
[null,null,"Criterio 30. Estado de las recomendaciones aceptadas (catálogo): con pruebas de cumplimiento total/con pruebas de cumplimiento parcial/sin pruebas de cumplimiento/con cumplimiento insatisfactorio/en tiempo para presentar pruebas de cumplimiento/en tiempo de ser contestadas/cuyo cumplimiento reviste características peculiares",1]
[null,null,"Criterio 31. Si la Recomendación se encuentra concluida, se publicará la fecha de conclusión del expediente con el formato día/mes/año ",1]
[null,null,"Criterio 32. Fecha de notificación de la conclusión con el formato día/mes/año ",1]
[null,null,"Criterio 33. Hipervínculo a la versión publica del Sistema de Seguimiento a Recomendaciones emitidas por la CNDH (SISER) y/o sistemas homólogos",1]
[null,null,"Criterio 34 . Ejercicio",1]
[null,null,"Criterio 35. Periodo que se informa (fecha de inicio y fecha de término con el formato día/mes/año)",1]
[null,null,"Criterio 36. Caso del que trata la recomendación",1]
[null,null,"Criterio 37. Fecha en la que se recibió la notificación de la recomendación con el formato día/mes/año ",1]
[null,null,"Criterio 38. Número de recomendación",1]
[null,null,"Criterio 39. Hipervínculo al sitio de Internet de la CNDH, concretamente, a la sección en la que se publican los Casos especiales. En su caso, al sitio de Internet de los organismos estatales en donde se publique la información en comento",1]
[null,null,"Criterio 40. Hipervínculo al buscador de recomendaciones internacionales a México en materia de derechos humanos",1]
[null,null,"Criterio 41. Ejercicio",1]
[null,null,"Criterio 42. Periodo que se informa (fecha de inicio y fecha de término con el formato día/mes/año)",1]
[null,null,"Criterio 43. Fecha en la que se emitió la información con el formato día/mes/año ",1]
[null,null,"Criterio 44. Nombre con el que el sujeto obligado identifica el caso",1]
[null,null,"Criterio 45. Derecho(s) humano(s) violado(s)",1]
[null,null,"Criterio 46. Víctima(s)",1]
[null,null,"Criterio 47. Órgano emisor de conformidad con el siguiente (catálogo):\nSistema Universal de Derechos Humanos\nÓrganos creados en virtud de tratados: Comité contra las Desapariciones Forzadas/Comité de los Derechos Económicos, Sociales y Culturales/Comité de los Derechos del Niño/Comité de los Derechos Humanos/Comité para la Eliminación de la Discriminación Racial/Comité contra la Tortura/Comité para la Eliminación de la Discriminación contra la Mujer/Comité de la Protección de los Derechos de Todos los Trabajadores Migratorios y de sus Familiares/Subcomité para la Prevención de la Tortura\nProcedimientos especiales: Grupo de Trabajo sobre Desapariciones Forzadas7Grupo de Trabajo sobre la Detención Arbitraria/Relator Especial contra la Tortura/Relator Especial sobre la venta de niños, la prostitución infantil y la utilización de niños en la pornografía/Relator especial sobre los efectos nocivos para el goce de los derechos humanos del traslado y vertimiento ilícitos de productos y desechos tóxicos y peligrosos/Relator Especial sobre Ejecuciones Extrajudiciales, Sumarias o Arbitrarias/Relator Especial sobre la independencia de los magistrados y abogados/Relator Especial sobre los Derechos Humanos de los Migrantes/Relator Especial sobre una vivienda adecuada como parte del derecho a un nivel de vida adecuado, y sobre el derecho a la no discriminación/Representante del Secretario General sobre los desplazados internos/Relator Especial sobre la situación de los derechos humanos y las libertades fundamentales de los indígenas/Relator Especial sobre la violencia contra la mujer, sus causas y consecuencias/Relator Especial sobre el derecho a la Educación/Relator Especial sobre el derecho a la Libertad de Expresión/Relator Especial sobre el derecho a la Alimentación u otros órganos\nSistema Interamericano de Derechos Humanos\nSistema de casos y peticiones: Comisión Interamericana de Derechos Humanos/Corte Interamericana de Derechos Humanos\nOtros mecanismos\nRelatoría Especial sobre los derechos de los Trabajadores Migratorios y Miembros de sus Familias/Relatoría Especial sobre la Libertad de Expresión/Relatoría Especial sobre Asuntos de la Mujer/Relatoría sobre los Derechos de las Personas Privadas de Libertad/Relatoría sobre los Derechos de las Personas Lesbianas, Gays, Bisexuales, Trans e Intersex/Relatoría sobre los Derechos de las Personas Afro-descendientes/Relatoría sobre los Derechos de los Pueblos Indígenas/Relatoría sobre Defensores y Defensoras de Derechos Humanos/Relatoría sobre los Derechos de la Niñez/Otro (especificar)",1]
[null,null,"Criterio 48. Fundamentos del caso o procedimiento",1]
[null,null,"Criterio 49. Etapa en la que se encuentra",1]
[null,null,"Criterio 50. Hipervínculo al informe, sentencia, resolución y/ o recomendación",{"$f":"IF(E126=\"Justificado\",0,1)","v":1}]
[null,null,"Criterio 51. Hipervínculo a la Ficha técnica completa",{"$f":"IF(E127=\"Justificado\",0,1)","v":1}]
[]
[null,null,"Criterios Adjetivos LTG 2018 - LTG 2020 (DOF 28/12/20) "]
[]
[null,null,"Criterio",null,"Valoración","Tipo","Observaciones, Recomendaciones y/o Requerimientos"]
[null,null,"Criterio 52. Periodo de actualización de la información: trimestral",{"$f":"IF(E132=\"Justificado\",0,1)","v":1}]
[null,null,"Criterio 53. La información deberá estar actualizada al periodo que corresponde, de acuerdo con la Tabla de actualización y conservación de la información",1]
[null,null,"Criterio 54. Conservar en el sitio de Internet y a través de la Plataforma Nacional la información  del ejercicio en curso. En caso de que el sujeto obligado haya recibido recomendación y/o sentencia conservará la información generada en el ejercicio en curso a partir de que le haya sido notificada. Una vez concluido el seguimiento de la recomendación y/o  entencia, conservar la información durante dos ejercicios. - Párrafo modificado DOF 28/12/2020",1]
[null,null,"Criterio 55. Área(s) responsable(s) que genera(n), posee(n), publica(n) y/o actualiza(n) la información ",1]
[null,null,"Criterio 56. Fecha de actualización de la información publicada con el formato día/mes/año",1]
[null,null,"Criterio 57. Fecha de validación de la información publicada con el formato día/mes/año",1]
[null,null,"Criterio 58. Nota. Este criterio se cumple en caso de que sea necesario que el sujeto obligado incluya alguna aclaración relativa a la información publicada y/o explicación por la falta de información ",1]
[null,null,"Criterio 59. La información publicada se organiza mediante los formatos 35a al 35c, en los que se incluyen todos los campos especificados en los criterios sustantivos de contenido",1]
[null,null,"Criterio 60. El soporte de la información permite su reutilización",1]
{"$rows_empty":7}
[{"$nulls":3},2017,2018]
[null,null,"CS",{"$f":"IF(Aplicabilidad!G46<>\"SI\",\"NA\",SUM(E19:E69)/SUM(D19:D69))","v":"NA"},{"$f":"IF(Aplicabilidad!G46<>\"SI\",\"NA\",SUM(E77:E127)/SUM(D77:D127))","v":"NA"}]
[null,null,"CA",{"$f":"IF(Aplicabilidad!G46<>\"SI\",\"NA\",SUM(#REF!)/SUM(#REF!))","v":"NA"},{"$f":"IF(Aplicabilidad!G46<>\"SI\",\"NA\",SUM(E132:E140)/SUM(D132:D140))","v":"NA"}]
[null,null,"OBLIGACIÓN",{"$f":"IF(Aplicabilidad!G46<>\"SI\",\"NA\",D149*0.6+D150*0.4)","v":"NA"},{"$f":"IF(Aplicabilidad!G46<>\"SI\",\"NA\",E149*0.6+E150*0.4)","v":"NA"}]

{"sheet":"Art 74_XXXVI","index":38,"n_rows":69,"n_cols":7,"rows_kept":69,"hidden":true,"merged":[[0,2,0,6],[4,1,4,7],[14,4,14,6],[31,4,31,6]]}
[null,null,{"$f":"IF(Aplicabilidad!E2=\"\",\"\",Aplicabilidad!E2)","v":"Consejería Jurídica"}]
[]
[null,"Códigos de valoración : Cumplió totalmente = 1; Cumplió parcialmente = 0.5; No cumplió = 0; Justificado = Justificado"]
[]
[null,"Art. 74 - Fracción XXXVI. Resoluciones y laudos de juicios"]
[]
[null,null,"Fecha de Inicio de la Verificación:",{"$nulls":3},"Fecha de Término de la verificación"]
[null,null,{"$f":"IF(Resultados!$C$7=\"\",\"\",Resultados!$C$7)","v":"2021-07-07"},"2018-05-25",null,null,{"$f":"IF(Resultados!G7=\"\",\"\",Resultados!G7)","v":"2021-07-08"}]
[]
[null,null,"Criterios Sustantivos",null,{"$f":"IF(Aplicabilidad!G47<>\"SI\",\"NA\",(SUM(E19:E28)+SUM(E36:E45))/(SUM(D19:D28)+SUM(D36:D45)))","v":"NA"}]
[null,null,"Criterios Adjetivos",null,{"$f":"IF(Aplicabilidad!G47<>\"SI\",\"NA\",(SUM(E50:E58))/(SUM(D50:D58)))","v":"NA"}]
[null,null,"Obligación",null,{"$f":"IF(Aplicabilidad!G47<>\"SI\",\"NA\",E10*0.6+E11*0.4)","v":"NA"}]
[]
[]
[]
[null,null,"Criterios Sustantivos de contenido \nLTG 2018 - LTG 2020 (DOF 28/12/20) ",{"$f":"COUNTA(F19:F29)","v":0}]
[]
[null,null,"Criterio",null,"Valoración","Tipo","Observaciones, Recomendaciones y/o Requerimientos"]
[null,null,"Criterio 1. Ejercicio",{"$f":"IF(E19=\"Justificado\",0,1)","v":1}]
[null,null,"Criterio 2. Periodo que se informa",{"$f":"IF(E20=\"Justificado\",0,1)","v":1}]
[null,null,"Criterio 3. Número de expediente y/o resolución. Especificar ambos en caso de ser distintos",1]
[null,null,"Criterio 4. Materia de la resolución: Administrativa/Judicial/Laudo",1]
[null,null,"Criterio 5. Tipo de la resolución: Definitiva (que haya causado estado o ejecutoria)",1]
[null,null,"Criterio 6. Fecha de la resolución con el formato día/mes/año (por ej. 31/Marzo/2016)",1]
[null,null,"Criterio 7. Órgano que emite la resolución",1]
[null,null,"Criterio 8. Sentido de la resolución",1]
[null,null,"Criterio 9. Hipervínculo a la resolución (versión pública)",{"$f":"IF(E27=\"Justificado\",0,1)","v":1}]
[null,null,"Criterio 10. Hipervínculo al Boletín oficial o medios de difusión homólogos para emitir resoluciones jurisdiccionales",{"$f":"IF(E28=\"Justificado\",0,1)","v":1}]
[]
[]
[]
[]
[null,null,"Criterios Sustantivos de contenido LTG 2018 - LTG 2020 (DOF 28/12/20) ",{"$f":"COUNTA(F36:F58)","v":1}]
[]
[null,null,"Criterio",null,"Valoración","Tipo","Observaciones, Recomendaciones y/o Requerimientos"]
[null,null,"Criterio 1. Ejercicio",{"$f":"IF(E36=\"Justificado\",0,1)","v":1}]
[null,null,"Criterio 2. Periodo que se informa (fecha de inicio y fecha de término con el formato día/mes/año)",{"$f":"IF(E37=\"Justificado\",0,1)","v":1}]
[null,null,"Criterio 3. Número de expediente y/o resolución. Especificar ambos en caso de ser distintos",1]
[null,null,"Criterio 4. Materia de la resolución (catálogo): Administrativa/Judicial/Laudo",1]
[null,null,"Criterio 5. Tipo de la resolución: Definitiva (que haya causado estado o ejecutoria)",1]
[null,null,"Criterio 6. Fecha de la resolución con el formato día/mes/año ",1]
[null,null,"Criterio 7. Órgano que emite la resolución",1]
[null,null,"Criterio 8. Sentido de la resolución",1]
[null,null,"Criterio 9. Hipervínculo a la resolución (versión pública)",{"$f":"IF(E44=\"Justificado\",0,1)","v":1}]
[null,null,"Criterio 10. Hipervínculo al Boletín oficial o medios de difusión homólogos para emitir resoluciones jurisdiccionales",{"$f":"IF(E45=\"Justificado\",0,1)","v":1}]
[]
[null,null,"Criterios Adjetivos LTG 2018 - LTG 2020 (DOF 28/12/20) "]
[]
[null,null,"Criterio",null,"Valoración","Tipo","Observaciones, Recomendaciones y/o Requerimientos"]
[null,null,"Criterio 11. Periodo de actualización de la información: trimestral",{"$f":"IF(E50=\"Justificado\",0,1)","v":1}]
[null,null,"Criterio 12. La información publicada deberá estar actualizada al periodo que corresponde, de acuerdo con la Tabla de actualización y conservación de la información",1]
[null,null,"Criterio 13. Conservar en el sitio de Internet y a través de la Plataforma Nacional la información de acuerdo con la Tabla de actualización y conservación de la información",1]
[null,null,"Criterio 14. Área(s) responsable(s) que genera(n), posee(n), publica(n) y/o actualiza(n) la información ",1]
[null,null,"Criterio 15. Fecha de actualización de la información publicada con el formato día/mes/año",1]
[null,null,"Criterio 16. Fecha de validación de la información publicada con el formato día/mes/año",1]
[null,null,"Criterio 17. Nota. Este criterio se cumple en caso de que sea necesario que el sujeto obligado incluya alguna aclaración relativa a la información publicada y/o explicación por la falta de información ",1]
[null,null,"Criterio 18. La información publicada se organiza mediante el formato 36, en el que se incluyen todos los campos especificados en los criterios sustantivos de contenido",1]
[null,null,"Criterio 19. El soporte de la información permite su reutilización",1]
{"$rows_empty":7}
[{"$nulls":3},2017,2018]
[null,null,"CS",{"$f":"IF(Aplicabilidad!G47<>\"SI\",\"NA\",SUM(E19:E28)/SUM(D19:D28))","v":"NA"},{"$f":"IF(Aplicabilidad!G47<>\"SI\",\"NA\",SUM(E36:E45)/SUM(D36:D45))","v":"NA"}]
[null,null,"CA",{"$f":"IF(Aplicabilidad!G47<>\"SI\",\"NA\",SUM(#REF!)/SUM(#REF!))","v":"NA"},{"$f":"IF(Aplicabilidad!G47<>\"SI\",\"NA\",SUM(E50:E58)/SUM(D50:D58))","v":"NA"}]
[null,null,"OBLIGACIÓN",{"$f":"IF(Aplicabilidad!G47<>\"SI\",\"NA\",D67*0.6+D68*0.4)","v":"NA"},{"$f":"IF(Aplicabilidad!G47<>\"SI\",\"NA\",E67*0.6+E68*0.4)","v":"NA"}]

{"sheet":"Art 74_XXXVII","index":39,"n_rows":95,"n_cols":7,"rows_kept":95,"hidden":true,"merged":[[0,2,0,6],[4,1,4,7],[14,4,14,6],[41,4,41,6]]}
[null,null,{"$f":"IF(Aplicabilidad!E2=\"\",\"\",Aplicabilidad!E2)","v":"Consejería Jurídica"}]
[]
[null,"Códigos de valoración : Cumplió totalmente = 1; Cumplió parcialmente = 0.5; No cumplió = 0; Justificado = Justificado"]
[]
[null,"Art. 74 - Fracción XXXVII. Mecanismos de participación ciudadana"]
[]
[null,null,"Fecha de Inicio de la Verificación:",{"$nulls":3},"Fecha de Término de la verificación"]
[null,null,{"$f":"IF(Resultados!$C$7=\"\",\"\",Resultados!$C$7)","v":"2021-07-07"},"2018-05-25",null,null,{"$f":"IF(Resultados!G7=\"\",\"\",Resultados!G7)","v":"2021-07-08"}]
[]
[null,null,"Criterios Sustantivos",null,{"$f":"IF(Aplicabilidad!G48<>\"SI\",\"NA\",(SUM(E19:E38)+SUM(E46:E71))/(SUM(D19:D38)+SUM(D46:D71)))","v":"NA"}]
[null,null,"Criterios Adjetivos",null,{"$f":"IF(Aplicabilidad!G48<>\"SI\",\"NA\",(SUM(E76:E84))/(SUM(D76:D84)))","v":"NA"}]
[null,null,"Obligación",null,{"$f":"IF(Aplicabilidad!G48<>\"SI\",\"NA\",E10*0.6+E11*0.4)","v":"NA"}]
[]
[]
[]
[null,null,"Criterios Sustantivos de contenido \nLTG 2018 - LTG 2020 (DOF 28/12/20) ",{"$f":"COUNTA(F19:F39)","v":0}]
[]
[null,null,"Criterio",null,"Valoración","Tipo","Observaciones, Recomendaciones y/o Requerimientos"]
[null,null,"Criterio 1. Ejercicio",{"$f":"IF(E19=\"Justificado\",0,1)","v":1}]
[null,null,"Criterio 2. Denominación del mecanismo de participación ciudadana",{"$f":"IF(E20=\"Justificado\",0,1)","v":1}]
[null,null,"Criterio 3. Fundamento jurídico, en su caso",1]
[null,null,"Criterio 4. Objetivo(s) del mecanismo de participación ciudadana",1]
[null,null,"Criterio 5. Alcances del mecanismo de participación ciudadana: Federal/Entidad federativa/Municipal/Delegacional",1]
[null,null,"Criterio 6. Hipervínculo a la convocatoria",1]
[null,null,"Criterio 7. Temas sujetos a revisión y consideración a través de los diferentes mecanismos de participación ciudadana",1]
[null,null,"Criterio 8. Requisitos de participación",1]
[null,null,"Criterio 9. Cómo recibirá el sujeto obligado las propuestas ciudadanas",1]
[null,null,"Criterio 10. Medio de recepción de las propuestas",1]
[null,null,"Criterio 11. Periodo de recepción de las propuestas ciudadanas; especificando fecha de inicio y término, con el formato día/mes/año (por ej. 31/Marzo/2016)",1]
[null,null,"Criterio 12. Nombre de la(s) unidad(es) administrativa(s) que gestiona el mecanismo de participación",1]
[null,null,"Criterio 13. Nombre(s), primer apellido, segundo apellido del(a) servidor(a) público(a) y/o de toda persona que desempeñe un empleo, cargo o comisión y/o ejerza actos de autoridad, y que sea la señalada para establecer contacto",1]
[null,null,"Criterio 14. Correo electrónico oficial",1]
[null,null,"Criterio 15. Domicilio de la oficina de atención (tipo de vialidad [catálogo], nombre de vialidad [calle], número exterior, número interior [en su caso], tipo de asentamiento humano [catálogo], nombre de asentamiento humano [colonia], clave de la localidad [catálogo], nombre de la localidad [catálogo], clave del municipio [catálogo], nombre del municipio o delegación [catálogo], clave de la entidad federativa [catálogo], nombre de la entidad federativa [catálogo], código postal)",1]
[null,null,"Criterio 16. Teléfono(s) y extensión(es)",1]
[null,null,"Criterio 17. Horario y días de atención",1]
[null,null,"Criterio 18. Resultados",1]
[null,null,"Criterio 19. Número total de participantes",{"$f":"IF(E37=\"Justificado\",0,1)","v":1}]
[null,null,"Criterio 20. Respuesta de la dependencia a los resultados de la participación, descripción sintética de lo que se tomó en cuenta y los criterios utilizados para retomar determinados elementos",{"$f":"IF(E38=\"Justificado\",0,1)","v":1}]
[]
[]
[]
[]
[null,null,"Criterios Sustantivos de contenido LTG 2018 - LTG 2020 (DOF 28/12/20) ",{"$f":"COUNTA(F46:F84)","v":1}]
[]
[null,null,"Criterio",null,"Valoración","Tipo","Observaciones, Recomendaciones y/o Requerimientos"]
[null,null,"Criterio 1. Ejercicio",{"$f":"IF(E46=\"Justificado\",0,1)","v":1}]
[null,null,"Criterio 2. Periodo que se informa (fecha de inicio y fecha de término con el formato día/mes/año)",{"$f":"IF(E47=\"Justificado\",0,1)","v":1}]
[null,null,"Criterio 3. Denominación del mecanismo de participación ciudadana",1]
[null,null,"Criterio 4. Fundamento jurídico, en su caso",1]
[null,null,"Criterio 5. Objetivo(s) del mecanismo de participación ciudadana",1]
[null,null,"Criterio 6. Alcances del mecanismo de participación ciudadana . Por ejemplo: Nacional, Federal, Entidad federativa, Municipal, Delegacional",1]
[null,null,"Criterio 7. Hipervínculo a la convocatoria",1]
[null,null,"Criterio 8. Temas sujetos a revisión y consideración a través de los diferentes mecanismos de participación ciudadana",1]
[null,null,"Criterio 9. Requisitos de participación",1]
[null,null,"Criterio 10. Cómo recibirá el sujeto obligado las propuestas ciudadanas",1]
[null,null,"Criterio 11. Medio de recepción de las propuestas",1]
[null,null,"Criterio 12. Fecha de inicio de recepción de las propuestas ciudadanas",1]
[null,null,"Criterio 13. Fecha de término de recepción de las propuestas ciudadanas",1]
[null,null,"Criterio 14. Nombre del(as) área(s) que gestiona el mecanismo de participación",1]
[null,null,"Criterio 15. Nombre(s), primer apellido, segundo apellido del(a) servidor(a) público(a) y/o de toda persona que desempeñe un empleo, cargo o comisión y/o ejerza actos de autoridad, y que sea la señalada para establecer contacto",1]
[null,null,"Criterio 16. Correo electrónico oficial",1]
[null,null,"Criterio 17. Domicilio de la oficina de atención (tipo de vialidad [catálogo], nombre de vialidad , número exterior, número interior [en su caso], tipo de asentamiento humano [catálogo], nombre de asentamiento humano [colonia], clave de la localidad , nombre de la localidad , clave del municipio , nombre del municipio o delegación , clave de la entidad federativa , nombre de la entidad federativa [catálogo], código postal)",1]
[null,null,"Criterio 18. Domicilio en el extranjero. En caso de que la oficina de atención se lleve a cabo en otro país, se deberá incluir el domicilio el cual deberá incluir por lo menos: país, ciudad, calle y número",1]
[null,null,"Criterio 19. Teléfono(s) y extensión(es)",1]
[null,null,"Criterio 20. Horario y días de atención",1]
[null,null,"Criterio 21. Ejercicio",1]
[null,null,"Criterio 22. Periodo que se informa (fecha de inicio y fecha de término con el formato día/mes/año)",1]
[null,null,"Criterio 23. Denominación del mecanismo de participación ciudadana",1]
[null,null,"Criterio 24. Resultados",1]
[null,null,"Criterio 25. Número total de participantes",{"$f":"IF(E70=\"Justificado\",0,1)","v":1}]
[null,null,"Criterio 26. Respuesta del sujeto obligado a los resultados de la participación, descripción sintética de lo que se tomó en cuenta y los criterios utilizados para retomar determinados elementos",{"$f":"IF(E71=\"Justificado\",0,1)","v":1}]
[]
[null,null,"Criterios Adjetivos LTG 2018 - LTG 2020 (DOF 28/12/20) "]
[]
[null,null,"Criterio",null,"Valoración","Tipo","Observaciones, Recomendaciones y/o Requerimientos"]
[null,null,"Criterio 27. Periodo de actualización de la información: trimestral",{"$f":"IF(E76=\"Justificado\",0,1)","v":1}]
[null,null,"Criterio 28. La información deberá estar actualizada al periodo que corresponde, de acuerdo con la Tabla de actualización y conservación de la información",1]
[null,null,"Criterio 29. Conservar en el sitio de Internet y a través de la Plataforma Nacional la información de acuerdo con la Tabla de actualización y conservación de la información",1]
[null,null,"Criterio 30. Área(s) responsable(s) que genera(n), posee(n), publica(n) y/o actualiza(n) la información  ",1]
[null,null,"Criterio 31. Fecha de actualización de la información publicada con el formato día/mes/año",1]
[null,null,"Criterio 32. Fecha de validación de la información publicada con el formato día/mes/año",1]
[null,null,"Criterio 33. Nota. Este criterio se cumple en caso de que sea necesario que el sujeto obligado incluya alguna aclaración relativa a la información publicada y/o explicación por la falta de información ",1]
[null,null,"Criterio 34. La información publicada se organiza mediante los formatos 37a y 37b, en el que se incluyen todos los campos especificados en los criterios sustantivos de contenido ",1]
[null,null,"Criterio 35. El soporte de la información permite su reutilización",1]
{"$rows_empty":7}
[{"$nulls":3},2017,2018]
[null,null,"CS",{"$f":"IF(Aplicabilidad!G48<>\"SI\",\"NA\",SUM(E19:E38)/SUM(D19:D38))","v":"NA"},{"$f":"IF(Aplicabilidad!G48<>\"SI\",\"NA\",SUM(E46:E71)/SUM(D46:D71))","v":"NA"}]
[null,null,"CA",{"$f":"IF(Aplicabilidad!G48<>\"SI\",\"NA\",SUM(#REF!)/SUM(#REF!))","v":"NA"},{"$f":"IF(Aplicabilidad!G48<>\"SI\",\"NA\",SUM(E76:E84)/SUM(D76:D84))","v":"NA"}]
[null,null,"OBLIGACIÓN",{"$f":"IF(Aplicabilidad!G48<>\"SI\",\"NA\",D93*0.6+D94*0.4)","v":"NA"},{"$f":"IF(Aplicabilidad!G48<>\"SI\",\"NA\",E93*0.6+E94*0.4)","v":"NA"}]

{"sheet":"Art 74_XXXVIII","index":40,"n_rows":141,"n_cols":7,"rows_kept":141,"hidden":true,"merged":[[0,2,0,6],[4,1,4,7],[14,4,14,6],[64,4,64,6]]}
[null,null,{"$f":"IF(Aplicabilidad!E2=\"\",\"\",Aplicabilidad!E2)","v":"Consejería Jurídica"}]
[]
[null,"Códigos de valoración : Cumplió totalmente = 1; Cumplió parcialmente = 0.5; No cumplió = 0; Justificado = Justificado"]
[]
[null,"Art. 74 - Fracción XXXVIII. Programas ofrecidos"]
[]
[null,null,"Fecha de Inicio de la Verificación:",{"$nulls":3},"Fecha de Término de la verificación"]
[null,null,{"$f":"IF(Resultados!$C$7=\"\",\"\",Resultados!$C$7)","v":"2021-07-07"},"2018-05-25",null,null,{"$f":"IF(Resultados!G7=\"\",\"\",Resultados!G7)","v":"2021-07-08"}]
[]
[null,null,"Criterios Sustantivos",null,{"$f":"IF(Aplicabilidad!G49<>\"SI\",\"NA\",(SUM(E19:E61)+SUM(E69:E117))/(SUM(D19:D61)+SUM(D69:D117)))","v":"NA"}]
[null,null,"Criterios Adjetivos",null,{"$f":"IF(Aplicabilidad!G49<>\"SI\",\"NA\",(SUM(E122:E130))/(SUM(D122:D130)))","v":"NA"}]
[null,null,"Obligación",null,{"$f":"IF(Aplicabilidad!G49<>\"SI\",\"NA\",E10*0.6+E11*0.4)","v":"NA"}]
[]
[]
[]
[null,null,"Criterios Sustantivos de contenido \nLTG 2018 - LTG 2020 (DOF 28/12/20) ",{"$f":"COUNTA(F19:F62)","v":0}]
[]
[null,null,"Criterio",null,"Valoración","Tipo","Observaciones, Recomendaciones y/o Requerimientos"]
[null,null,"Criterio 1. Ejercicio",{"$f":"IF(E19=\"Justificado\",0,1)","v":0},"Justificado"]
[null,null,"Criterio 2. Periodo que se informa",{"$f":"IF(E20=\"Justificado\",0,1)","v":0},"Justificado"]
[null,null,"Criterio 3. Presupuesto asignado al programa, en su caso",0,"Justificado"]
[null,null,"Criterio 4. Origen de los recursos, en su caso",0,"Justificado"]
[null,null,"Criterio 5. Tipo de participación del Gobierno Federal o local (directa o indirecta) y en qué consiste ésta, en su caso",0,"Justificado"]
[null,null,"Criterio 6. Diagnóstico",0,"Justificado"]
[null,null,"Criterio 7. Resumen (describir brevemente en qué consiste el programa)",0,"Justificado"]
[null,null,"Criterio 8. Vigencia del programa: fecha de inicio y de término con el formato día/mes/año (por ej. 31/Marzo/2016)",0,"Justificado"]
[null,null,"Criterio 9. Objetivo(s) del programa (fin que pretende alcanzar)",0,"Justificado"]
[null,null,"Criterio 10. Ámbitos de intervención",0,"Justificado"]
[null,null,"Criterio 11. Cobertura territorial",0,"Justificado"]
[null,null,"Criterio 12. Acciones que se emprenderán",0,"Justificado"]
[null,null,"Criterio 13. Participantes/beneficiarios (descripción de la población objetivo)",0,"Justificado"]
[null,null,"Criterio 14. Proceso básico del programa (fases, pasos a seguir, hipervínculo al diagrama)",0,"Justificado"]
[null,null,"Criterio 15. Tipo de apoyo (económico, en especie, otros)",0,"Justificado"]
[null,null,"Criterio 16. Monto que otorga el programa, en su caso",0,"Justificado"]
[null,null,"Criterio 17. Convocatoria, en su caso, especificar que opera todo el año",0,"Justificado"]
[null,null,"Criterio 18. Sujeto(s) obligado(s) que opera(n) cada programa",0,"Justificado"]
[null,null,"Criterio 19. Nombre(s), primer apellido, segundo apellido del responsable de la gestión del programa para establecer contacto",0,"Justificado"]
[null,null,"Criterio 20. Correo electrónico oficial",0,"Justificado"]
[null,null,"Criterio 21. Nombre de la(s) unidad(es) administrativa(s) responsable(s)",0,"Justificado"]
[null,null,"Criterio 22. Domicilio de la oficina de atención (tipo de vialidad [catálogo], nombre de vialidad [calle], número exterior, número interior [en su caso], tipo de asentamiento humano [catálogo], nombre de asentamiento humano [colonia], clave de la localidad [catálogo], nombre de la localidad [catálogo], clave del municipio [catálogo], nombre del municipio o delegación [catálogo], clave de la entidad federativa [catálogo], nombre de la entidad federativa [catálogo], código postal)",0,"Justificado"]
[null,null,"Criterio 23. Teléfono(s) y extensión(es)",0,"Justificado"]
[null,null,"Criterio 24. Horario y días de atención",0,"Justificado"]
[null,null,"Criterio 25. Nombre del trámite",0,"Justificado"]
[null,null,"Criterio 26. Nombre del programa para el cual se realiza el trámite",0,"Justificado"]
[null,null,"Criterio 27. Fundamento jurídico",0,"Justificado"]
[null,null,"Criterio 28. Casos en los que se debe o puede presentar el trámite",0,"Justificado"]
[null,null,"Criterio 29. Forma de presentación (escrito libre o formato específico)",0,"Justificado"]
[null,null,"Criterio 30. Tiempo de respuesta (plazo máximo de respuesta y si se aplica la afirmativa o negativa ficta)",0,"Justificado"]
[null,null,"Criterio 31. Formato(s) específico(s) para acceder al programa. En su caso, especificar que no se requiere",0,"Justificado"]
[null,null,"Criterio 32. Datos y documentos que debe contener o se deben adjuntar al trámite",0,"Justificado"]
[null,null,"Criterio 33. Monto de los derechos o aprovechamientos",0,"Justificado"]
[null,null,"Criterio 34. Descripción de la forma en que se determina el monto, en su caso, fundamento jurídico",0,"Justificado"]
[null,null,"Criterio 35. Nombre(s), primer apellido, segundo apellido del responsable de la gestión del trámite para establecer contacto",0,"Justificado"]
[null,null,"Criterio 36. Correo electrónico oficial",0,"Justificado"]
[null,null,"Criterio 37. Nombre de la(s) unidad(es) administrativa(s) responsable(s)",0,"Justificado"]
[null,null,"Criterio 38. Domicilio de la oficina de atención (tipo de vialidad [catálogo], nombre de vialidad [calle], número exterior, número interior [en su caso], tipo de asentamiento humano [catálogo], nombre de asentamiento humano [colonia], clave de la localidad [catálogo], nombre de la localidad [catálogo], clave del municipio [catálogo], nombre del municipio o delegación [catálogo], clave de la entidad federativa [catálogo], nombre de la entidad federativa [catálogo], código postal)",0,"Justificado"]
[null,null,"Criterio 39. Teléfono(s) y extensión(es)",0,"Justificado"]
[null,null,"Criterio 40. Horario y días de atención",0,"Justificado"]
[null,null,"Criterio 41. Dirección electrónica alterna u otro medio para el envío de consultas o documentos",0,"Justificado"]
[null,null,"Criterio 42. Derechos del usuario(a) ante la negativa o falta de respuesta",{"$f":"IF(E60=\"Justificado\",0,1)","v":0},"Justificado"]
[null,null,"Criterio 43. Lugares para reportar presuntas anomalías en la prestación del servicio",{"$f":"IF(E61=\"Justificado\",0,1)","v":0},"Justificado"]
[]
[]
[]
[]
[null,null,"Criterios Sustantivos de contenido \nLTG 2018 - LTG 2020 (DOF 28/12/20) ",{"$f":"COUNTA(F69:F130)","v":1}]
[]
[null,null,"Criterio",null,"Valoración","Tipo","Observaciones, Recomendaciones y/o Requerimientos"]
[null,null,"Criterio 1. Ejercicio",{"$f":"IF(E69=\"Justificado\",0,1)","v":1}]
[null,null,"Criterio 2. Periodo que se informa (fecha de inicio y fecha de término con el formato día/mes/año)",{"$f":"IF(E70=\"Justificado\",0,1)","v":1}]
[null,null,"Criterio 3. Nombre del programa",1]
[null,null,"Criterio 4. Clave de la partida presupuestal",1]
[null,null,"Criterio 5. Denominación de la partida presupuestal",1]
[null,null,"Criterio 6. Presupuesto asignado al programa, en su caso",1]
[null,null,"Criterio 7. Origen de los recursos, en su caso",1]
[null,null,"Criterio 8. Tipo de participación del Gobierno Federal o local (directa o indirecta) y en qué consiste ésta, en su caso",1]
[null,null,"Criterio 9. Ámbitos de intervención",1]
[null,null,"Criterio 10. Cobertura territorial",1]
[null,null,"Criterio 11. Diagnóstico (los datos, hechos o circunstancias de la situación actual recabados por el sujeto obligado que le permitieron identificar problemas que requieren el desarrollo del programa que se trate)",1]
[null,null,"Criterio 12. Resumen (describir brevemente en qué consiste el programa)",1]
[null,null,"Criterio 13. Fecha de inicio de vigencia del programa, con el formato día/mes/año",1]
[null,null,"Criterio 14. Fecha de término de vigencia del programa, con el formato día/mes/año",1]
[null,null,"Criterio 15. Objetivo(s) del programa (fin que pretende alcanzar)",1]
[null,null,"Criterio 16. Acciones que se emprenderán",1]
[null,null,"Criterio 17. Participantes/beneficiarios (descripción de la población objetivo)",1]
[null,null,"Criterio 18. Hipervínculo al proceso básico del programa (fases, pasos a seguir, hipervínculo al diagrama)",1]
[null,null,"Criterio 19. Tipo de apoyo (catálogo): económico/en especie/otros, especificar",1]
[null,null,"Criterio 20. Monto que otorga el programa, en su caso",1]
[null,null,"Criterio 21. Convocatoria, en su caso, especificar que opera todo el año",1]
[null,null,"Criterio 22. Sujeto(s) obligado(s) que opera(n) cada programa",1]
[null,null,"Criterio 23. Nombre(s), primer apellido, segundo apellido del responsable de la gestión del programa para establecer contacto",1]
[null,null,"Criterio 24. Correo electrónico oficial",1]
[null,null,"Criterio 25. Nombre del área(s)  responsable(s)",1]
[null,null,"Criterio 26. Domicilio de la oficina de atención (tipo de vialidad [catálogo], nombre de vialidad [calle], número exterior, número interior [en su caso], tipo de asentamiento humano [catálogo], nombre de asentamiento humano [colonia], clave de la localidad , nombre de la localidad , clave del municipio , nombre del municipio o delegación, clave de la entidad federativa, nombre de la entidad federativa [catálogo], código postal)",1]
[null,null,"Criterio 27. Teléfono(s) y extensión(es)",1]
[null,null,"Criterio 28. Horario y días de atención",1]
[null,null,"Criterio 29. Ejercicio",1]
[null,null,"Criterio 30. Periodo que se informa (fecha de inicio y fecha de término con el formato día/mes/año)",1]
[null,null,"Criterio 31. Nombre del programa para el cual se realiza el trámite",1]
[null,null,"Criterio 32. Nombre del trámite, en su caso",1]
[null,null,"Criterio 33. Fundamento jurídico",1]
[null,null,"Criterio 34. Casos en los que se debe o puede presentar el trámite",1]
[null,null,"Criterio 35. Forma de presentación (escrito libre o formato específico)",1]
[null,null,"Criterio 36. Tiempo de respuesta (plazo máximo de respuesta y si se aplica la afirmativa o negativa ficta)",1]
[null,null,"Criterio 37. Hipervínculo a los formato(s) específico(s) para acceder al programa. En su caso, especificar que no se requiere",1]
[null,null,"Criterio 38. Datos y documentos que debe contener o se deben adjuntar al trámite",1]
[null,null,"Criterio 39. Monto de los derechos o aprovechamientos",1]
[null,null,"Criterio 40. Descripción de la forma en que se determina el monto, en su caso, fundamento jurídico",1]
[null,null,"Criterio 41. Nombre(s), primer apellido, segundo apellido del responsable de la gestión del trámite para establecer contacto",1]
[null,null,"Criterio 42. Correo electrónico oficial",1]
[null,null,"Criterio 43. Nombre del área(s)  responsable(s)",1]
[null,null,"Criterio 44. Domicilio de la oficina de atención (tipo de vialidad [catálogo], nombre de vialidad [calle], número exterior, número interior [en su caso], tipo de asentamiento humano [catálogo], nombre de asentamiento humano [colonia], clave de la localidad, nombre de la localidad, clave del municipio, nombre del municipio o delegación, clave de la entidad federativa, nombre de la entidad federativa [catálogo], código postal)",1]
[null,null,"Criterio 45. Teléfono(s) y extensión(es)",1]
[null,null,"Criterio 46. Horario y días de atención",1]
[null,null,"Criterio 47. Dirección electrónica alterna u otro medio para el envío de consultas o documentos",1]
[null,null,"Criterio 48. Derechos del usuario(a) ante la negativa o falta de respuesta",{"$f":"IF(E116=\"Justificado\",0,1)","v":1}]
[null,null,"Criterio 49. Lugares para reportar presuntas anomalías en la prestación del servicio",{"$f":"IF(E117=\"Justificado\",0,1)","v":1}]
[]
[null,null,"Criterios Adjetivos LTG 2018 - LTG 2020 (DOF 28/12/20) "]
[]
[null,null,"Criterio",null,"Valoración","Tipo","Observaciones, Recomendaciones y/o Requerimientos"]
[null,null,"Criterio 50. Periodo de actualización de la información: trimestral ",{"$f":"IF(E122=\"Justificado\",0,1)","v":1}]
[null,null,"Criterio 51. La información deberá estar actualizada al periodo que corresponde, de acuerdo con la Tabla de actualización y conservación de la información",1]
[null,null,"Criterio 52.Conservar en el sitio de Internet: información del ejercicio en curso y la correspondiente a los dos ejercicios anteriores",1]
[null,null,"Criterio 53. Área(s) responsable(s) que genera(n), posee(n), publica(n) y/o actualiza(n) la información ",1]
[null,null,"Criterio 54. Fecha de actualización de la información publicada con el formato día/mes/año",1]
[null,null,"Criterio 55. Fecha de validación de la información publicada con el formato día/mes/año",1]
[null,null,"Criterio 56. Nota. Este criterio se cumple en caso de que sea necesario que el sujeto obligado incluya alguna aclaración relativa a la información publicada y/o explicación por la falta de información",1]
[null,null,"Criterio 57. La información publicada se organiza mediante los formatos 38a y 38b, en los que se incluyen todos los campos especificados en los criterios sustantivos de contenido",1]
[null,null,"Criterio 58. El soporte de la información permite su reutilización",1]
{"$rows_empty":7}
[{"$nulls":3},2017,2018]
[null,null,"CS",{"$f":"IF(Aplicabilidad!G49<>\"SI\",\"NA\",SUM(E19:E61)/SUM(D19:D61))","v":"NA"},{"$f":"IF(Aplicabilidad!G49<>\"SI\",\"NA\",SUM(E69:E117)/SUM(D69:D117))","v":"NA"}]
[null,null,"CA",{"$f":"IF(Aplicabilidad!G49<>\"SI\",\"NA\",SUM(#REF!)/SUM(#REF!))","v":"NA"},{"$f":"IF(Aplicabilidad!G49<>\"SI\",\"NA\",SUM(E122:E130)/SUM(D122:D130))","v":"NA"}]
[null,null,"OBLIGACIÓN",{"$f":"IF(Aplicabilidad!G49<>\"SI\",\"NA\",D139*0.6+D140*0.4)","v":"NA"},{"$f":"IF(Aplicabilidad!G49<>\"SI\",\"NA\",E139*0.6+E140*0.4)","v":"NA"}]

{"sheet":"Art 74_XXXIX","index":41,"n_rows":100,"n_cols":7,"rows_kept":100,"merged":[[0,2,0,6],[4,1,4,7],[14,4,14,6],[45,4,45,6],[49,1,59,1],[60,1,63,1],[64,1,69,1],[70,1,75,1]]}
[null,null,{"$f":"IF(Aplicabilidad!E2=\"\",\"\",Aplicabilidad!E2)","v":"Consejería Jurídica"}]
[]
[null,"Códigos de valoración : Cumplió totalmente = 1; Cumplió parcialmente = 0.5; No cumplió = 0; Justificado = Justificado"]
[]
[null,"Art. 74 - Fracción XXXIX. Actas y resoluciones del Comité de Transparencia"]
[]
[null,null,"Fecha de Inicio de la Verificación:",{"$nulls":3},"Fecha de Término de la verificación"]
[null,null,{"$f":"IF(Resultados!$C$7=\"\",\"\",Resultados!$C$7)","v":"2021-07-07"},"2018-05-25",null,null,{"$f":"IF(Resultados!G7=\"\",\"\",Resultados!G7)","v":"2021-07-08"}]
[]
[null,null,"Criterios Sustantivos",null,{"$f":"IF(Aplicabilidad!G50<>\"SI\",\"NA\",(SUM(E19:E42)+SUM(E50:E76))/(SUM(D19:D42)+SUM(D50:D76)))","v":{"v":1,"d":"100%"}}]
[null,null,"Criterios Adjetivos",null,{"$f":"IF(Aplicabilidad!G50<>\"SI\",\"NA\",(SUM(E81:E89))/(SUM(D81:D89)))","v":{"v":1,"d":"100%"}}]
[null,null,"Obligación",null,{"$f":"IF(Aplicabilidad!G50<>\"SI\",\"NA\",E10*0.6+E11*0.4)","v":{"v":1,"d":"100.00%"}}]
[]
[]
[]
[null,null,"Criterios Sustantivos de contenido \nLTG 2018 - LTG 2020 (DOF 28/12/20) ",{"$f":"COUNTA(F19:F43)","v":0}]
[]
[null,null,"Criterio",null,"Valoración","Tipo","Observaciones, Recomendaciones y/o Requerimientos"]
[null,null,"Criterio 1. Ejercicio",{"$f":"IF(E19=\"Justificado\",0,1)","v":0},"Justificado"]
[null,null,"Criterio 2. Periodo que se informa",{"$f":"IF(E20=\"Justificado\",0,1)","v":0},"Justificado"]
[null,null,"Criterio 3. Número de sesión (por ej. Primera sesión ordinaria/ Primera sesión extraordinaria)",0,"Justificado"]
[null,null,"Criterio 4. Fecha de la sesión con el formato día/mes/año (por ej. 29/Mayo/2016)",0,"Justificado"]
[null,null,"Criterio 5. Folio de la solicitud de acceso a la información",0,"Justificado"]
[null,null,"Criterio 6. Número o clave de acuerdo del Comité (por ej. 001/SCT-29-01/2016)",0,"Justificado"]
[null,null,"Criterio 7. Área(s) que presenta(n) la propuesta",0,"Justificado"]
[null,null,"Criterio 8. Propuesta: Ampliación de plazo/Acceso restringido reservada/Acceso restringido confidencial/Inexistencia de información/Incompetencia/ Ampliación de plazo reserva",0,"Justificado"]
[null,null,"Criterio 9. Sentido de la resolución del Comité: Confirma; Modifica; Revoca",0,"Justificado"]
[null,null,"Criterio 10. Votación (por unanimidad o mayoría de votos)",0,"Justificado"]
[null,null,"Criterio 11. Hipervínculo a la resolución del Comité de Transparencia",0,"Justificado"]
[null,null,"Criterio 12. Ejercicio",0,"Justificado"]
[null,null,"Criterio 13. Periodo que se informa",0,"Justificado"]
[null,null,"Criterio 14. Fecha de la resolución y/o acta",0,"Justificado"]
[null,null,"Criterio 15. Hipervínculo al documento de la resolución y/o acta,",0,"Justificado"]
[null,null,"Criterio 16. Nombre completo del Presidente y de los integrantes del Comité de Transparencia del sujeto obligado para cumplir con las funciones establecidas en el Capítulo III, Título Segundo de la Ley General, independientemente de que su nivel sea menor al de jefe de departamento u homólogo (nombre[s], primer apellido, segundo apellido), los cuales deberán guardar correspondencia con los publicados en la fracción VII (directorio)",0,"Justificado"]
[null,null,"Criterio 17. Cargo o puesto que ocupa en el sujeto obligado",0,"Justificado"]
[null,null,"Criterio 18. Cargo y/o función que desempeña en el Comité de Transparencia",0,"Justificado"]
[null,null,"Criterio 19. Correo electrónico oficial activo del Presidente y de los demás integrantes del Comité de Transparencia",0,"Justificado"]
[null,null,"Criterio 20. Ejercicio",0,"Justificado"]
[null,null,"Criterio 21. Número de sesión",0,"Justificado"]
[null,null,"Criterio 22. Mes",0,"Justificado"]
[null,null,"Criterio 23. Día",{"$f":"IF(E41=\"Justificado\",0,1)","v":0},"Justificado"]
[null,null,"Criterio 24. Hipervínculo al acta de la sesión",{"$f":"IF(E42=\"Justificado\",0,1)","v":0},"Justificado"]
[]
[]
[]
[]
[null,null,"Criterios Sustantivos de contenido \nLTG 2018 - LTG 2020 (DOF 28/12/20) ",{"$f":"COUNTA(F50:F89)","v":1}]
[]
[null,null,"Criterio",null,"Valoración","Tipo","Observaciones, Recomendaciones y/o Requerimientos"]
[null,"Formato 39a","Resoluciones del Comité de Transparencia sobre Ampliación de plazo; Acceso restringido reservada; Acceso restringido Confidencial; Inexistencia de información; Incompetencia; Ampliación de plazo Reserva, según corresponda, con los siguientes datos:\nCriterio 1. Ejercicio",{"$f":"IF(E50=\"Justificado\",0,1)","v":1},1]
[null,null,"Criterio 2. Periodo que se informa (fecha de inicio y fecha de término con el formato día/mes/año)",{"$f":"IF(E51=\"Justificado\",0,1)","v":1},1]
[null,null,"Criterio 3. Número de sesión. Por ejemplo: Primera sesión ordinaria, Primera sesión extraordinaria",1,1]
[null,null,"Criterio 4. Fecha de la sesión con el formato día/mes/año",1,1]
[null,null,"Criterio 5. Folio de la solicitud de acceso a la información",1,1]
[null,null,"Criterio 6. Número o clave de acuerdo del Comité. Por ejemplo:001/SCT-29-01/2016",1,1]
[null,null,"Criterio 7. Área(s) que presenta(n) la propuesta",1,1]
[null,null,"Criterio 8. Propuesta (catálogo): Ampliación de plazo/Acceso restringido reservada/Acceso restringido confidencial/Inexistencia de información/Incompetencia/ Ampliación de plazo reserva",1,1]
[null,null,"Criterio 9. Sentido de la resolución del Comité (catálogo): Confirma/Modifica/Revoca",1,1]
[null,null,"Criterio 10. Votación (catálogo): Por unanimidad de votos/Por mayoría de votos/Por mayoría de votos ponderados",1,1]
[null,null,"Criterio 11. Hipervínculo a la resolución del Comité de Transparencia",1,1]
[null,"Formato 39b","Respecto del Comité de Transparencia sobre las acciones, procedimientos, políticas, programas de capacitación y actualización, según corresponda, se publicará lo siguiente:\nCriterio 12. Ejercicio",1,1]
[null,null,"Criterio 13. Periodo que se informa (fecha de inicio y fecha de término con el formato día/mes/año)",1,1]
[null,null,"Criterio 14. Fecha de la resolución y/o acta con el formato día/mes/año",0,"Justificado"]
[null,null,"Criterio 15. Hipervínculo al documento de la resolución y/o acta,",0,"Justificado"]
[null,"Formato 39c","Integrantes del Comité de Transparencia\nCriterio 16. Ejercicio",1,1]
[null,null,"Criterio 17. Periodo que se informa (fecha de inicio y fecha de término con el formato día/mes/año)",1,1]
[null,null,"Criterio 18. Nombre completo del Presidente y de los integrantes del Comité de Transparencia del sujeto obligado para cumplir con las funciones establecidas en el Capítulo III, Título Segundo de la Ley General, independientemente de que su nivel sea menor al de jefe de departamento u homólogo (nombre[s], primer apellido, segundo apellido)",1,1]
[null,null,"Criterio 19. Cargo o puesto que ocupa en el sujeto obligado",1,1]
[null,null,"Criterio 20. Cargo y/o función que desempeña en el Comité de Transparencia",1,1]
[null,null,"Criterio 21. Correo electrónico oficial activo del Presidente y de los demás integrantes del Comité de Transparencia",1,1]
[null,"Formato 39d","Calendario de sesiones ordinarias del Comité de Transparencia y actas de las sesiones ordinarias y, en su caso, extraordinarias\nCriterio 22. Ejercicio",1,1]
[null,null,"Criterio 23. Periodo que se informa (fecha de inicio y fecha de término con el formato día/mes/año)",1,1]
[null,null,"Criterio 24. Número de sesión",1,1]
[null,null,"Criterio 25. Mes",1,1]
[null,null,"Criterio 26. Día",{"$f":"IF(E75=\"Justificado\",0,1)","v":1},1]
[null,null,"Criterio 27. Hipervínculo al acta de la sesión",{"$f":"IF(E76=\"Justificado\",0,1)","v":1},1]
[]
[null,null,"Criterios Adjetivos LTG 2018 - LTG 2020 (DOF 28/12/20) "]
[]
[null,null,"Criterio",null,"Valoración","Tipo","Observaciones, Recomendaciones y/o Requerimientos"]
[null,null,"Criterio 28. Periodo de actualización: semestral, respecto de las sesiones y resoluciones.\nEl calendario de las sesiones a celebrar, se publicará en el primer trimestre de cada año y se actualizará trimestralmente con los hipervínculos a las actas de las sesiones y la información de las sesiones extraordinarias que, en su caso, se celebren.\nRespecto a los integrantes del Comité de transparencia, se actualizará trimestralmente la información correspondiente.",{"$f":"IF(E81=\"Justificado\",0,1)","v":1},1]
[null,null,"Criterio 29. La información deberá estar actualizada al periodo que corresponde, de acuerdo con la Tabla de actualización y conservación de la información",1,1]
[null,null,"Criterio 30. Conservar en el sitio de Internet: información del ejercicio en curso y la correspondiente al ejercicio anterior. Respecto de los integrantes del Comité de Transparencia, información vigente.",1,1]
[null,null,"Criterio 31. Área(s) responsable(s) que genera(n), posee(n), publica(n) y/o actualiza(n) la información ",1,1]
[null,null,"Criterio 32. Fecha de actualización de la información publicada con el formato día/mes/año",1,1]
[null,null,"Criterio 33. Fecha de validación de la información publicada con el formato día/mes/año",1,1]
[null,null,"Criterio 34. Nota. Este criterio se cumple en caso de que sea necesario que el sujeto obligado incluya alguna aclaración relativa a la información publicada y/o explicación por la falta de información",1,1]
[null,null,"Criterio 35. La información publicada se organiza mediante los formatos 39a, 39b, 39c y 39d, en los que se incluyen todos los campos especificados en los criterios sustantivos de contenido",1,1]
[null,null,"Criterio 36. El soporte de la información permite su reutilización",1,1]
{"$rows_empty":7}
[{"$nulls":3},2017,2018]
[null,null,"CS",{"$f":"IF(Aplicabilidad!G50<>\"SI\",\"NA\",SUM(E19:E42)/SUM(D19:D42))","v":{"$error":"#DIV/0!"}},{"$f":"IF(Aplicabilidad!G50<>\"SI\",\"NA\",SUM(E50:E76)/SUM(D50:D76))","v":{"v":1,"d":"100.00%"}}]
[null,null,"CA",{"$f":"IF(Aplicabilidad!G50<>\"SI\",\"NA\",SUM(#REF!)/SUM(#REF!))","v":{"$error":"#REF!"}},{"$f":"IF(Aplicabilidad!G50<>\"SI\",\"NA\",SUM(E81:E89)/SUM(D81:D89))","v":{"v":1,"d":"100.00%"}}]
[null,null,"OBLIGACIÓN",{"$f":"IF(Aplicabilidad!G50<>\"SI\",\"NA\",D98*0.6+D99*0.4)","v":{"$error":"#DIV/0!"}},{"$f":"IF(Aplicabilidad!G50<>\"SI\",\"NA\",E98*0.6+E99*0.4)","v":{"v":1,"d":"100.00%"}}]

{"sheet":"Art 74_XL","index":42,"n_rows":69,"n_cols":7,"rows_kept":69,"merged":[[0,2,0,6],[4,1,4,7],[14,4,14,6],[30,4,30,6]]}
[null,null,{"$f":"IF(Aplicabilidad!E2=\"\",\"\",Aplicabilidad!E2)","v":"Consejería Jurídica"}]
[]
[null,"Códigos de valoración : Cumplió totalmente = 1; Cumplió parcialmente = 0.5; No cumplió = 0; Justificado = Justificado"]
[]
[null,"Art. 74 - Fracción XL. Evaluaciones y encuestas a programas financiados con recursos públicos"]
[]
[null,null,"Fecha de Inicio de la Verificación:",{"$nulls":3},"Fecha de Término de la verificación"]
[null,null,{"$f":"IF(Resultados!$C$7=\"\",\"\",Resultados!$C$7)","v":"2021-07-07"},"2018-05-25",null,null,{"$f":"IF(Resultados!G7=\"\",\"\",Resultados!G7)","v":"2021-07-08"}]
[]
[null,null,"Criterios Sustantivos",null,{"$f":"IF(Aplicabilidad!G51<>\"SI\",\"NA\",(SUM(E19:E27)+SUM(E35:E45))/(SUM(D19:D27)+SUM(D35:D45)))","v":{"v":1,"d":"100%"}}]
[null,null,"Criterios Adjetivos",null,{"$f":"IF(Aplicabilidad!G51<>\"SI\",\"NA\",(SUM(E50:E58))/(SUM(D50:D58)))","v":{"v":1,"d":"100%"}}]
[null,null,"Obligación",null,{"$f":"IF(Aplicabilidad!G51<>\"SI\",\"NA\",E10*0.6+E11*0.4)","v":{"v":1,"d":"100.00%"}}]
[]
[]
[]
[null,null,"Criterios Sustantivos de contenido \nLTG 2018 - LTG 2020 (DOF 28/12/20) ",{"$f":"COUNTA(F19:F28)","v":0}]
[]
[null,null,"Criterio",null,"Valoración","Tipo","Observaciones, Recomendaciones y/o Requerimientos"]
[null,null,"Criterio 1. Ejercicio",{"$f":"IF(E19=\"Justificado\",0,1)","v":0},"Justificado"]
[null,null,"Criterio 2. Denominación del programa evaluado",{"$f":"IF(E20=\"Justificado\",0,1)","v":0},"Justificado"]
[null,null,"Criterio 3. Denominación de la evaluación",0,"Justificado"]
[null,null,"Criterio 4. Hipervínculo a los resultados de la evaluación (registrados en el Formato para la difusión de los resultados de la evaluaciones)",0,"Justificado"]
[null,null,"Criterio 5. Ejercicio",0,"Justificado"]
[null,null,"Criterio 6. Tipo de encuesta",0,"Justificado"]
[null,null,"Criterio 7. Denominación de la encuesta",0,"Justificado"]
[null,null,"Criterio 8. Objetivo de la encuesta",{"$f":"IF(E26=\"Justificado\",0,1)","v":0},"Justificado"]
[null,null,"Criterio 9. Hipervínculo a los resultados de las encuestas. En su caso, se incluirá la versión pública",{"$f":"IF(E27=\"Justificado\",0,1)","v":0},"Justificado"]
[]
[]
[]
[]
[null,null,"Criterios Sustantivos de contenido LTG 2018 - LTG 2020 (DOF 28/12/20) ",{"$f":"COUNTA(F35:F58)","v":1}]
[]
[null,null,"Criterio",null,"Valoración","Tipo","Observaciones, Recomendaciones y/o Requerimientos"]
[null,null,"Criterio 1. Ejercicio",{"$f":"IF(E35=\"Justificado\",0,1)","v":1},1]
[null,null,"Criterio 2. Periodo que se informa (fecha de inicio y fecha de término con el formato día/mes/año)",{"$f":"IF(E36=\"Justificado\",0,1)","v":1},1]
[null,null,"Criterio 3. Denominación del programa evaluado",0,"Justificado"]
[null,null,"Criterio 4. Denominación de la evaluación",0,"Justificado"]
[null,null,"Criterio 5. Hipervínculo a los resultados de la evaluación (registrados en el Formato para la difusión de los resultados de las evaluaciones)",0,"Justificado"]
[null,null,"Criterio 6. Ejercicio",1,1]
[null,null,"Criterio 7. Periodo que se informa (fecha de inicio y fecha de término con el formato día/mes/año)",1,1]
[null,null,"Criterio 8. Tipo de encuesta",0,"Justificado"]
[null,null,"Criterio 9. Denominación de la encuesta",0,"Justificado"]
[null,null,"Criterio 10. Objetivo de la encuesta",{"$f":"IF(E44=\"Justificado\",0,1)","v":0},"Justificado"]
[null,null,"Criterio 11. Hipervínculo a los resultados de las encuestas. En su caso, se incluirá la versión pública",{"$f":"IF(E45=\"Justificado\",0,1)","v":0},"Justificado"]
[]
[null,null,"Criterios Adjetivos LTG 2018 - LTG 2020 (DOF 28/12/20) "]
[]
[null,null,"Criterio",null,"Valoración","Tipo","Observaciones, Recomendaciones y/o Requerimientos"]
[null,null,"Criterio 12. Periodo de actualización de la información: anual",{"$f":"IF(E50=\"Justificado\",0,1)","v":1},1]
[null,null,"Criterio 13. La información deberá estar actualizada al periodo que corresponde, de acuerdo con la Tabla de actualización y conservación de la información",1,1]
[null,null,"Criterio 14. Conservar en el sitio de Internet: información generada en los dos ejercicios anteriores concluidos - Párrafo modificado DOF 28/12/2020",1,1]
[null,null,"Criterio 15. Área(s) responsable(s) que genera(n), posee(n), publica(n) y/o actualiza(n) la información ",1,1]
[null,null,"Criterio 16. Fecha de actualización de la información publicada con el formato día/mes/año",1,1]
[null,null,"Criterio 17. Fecha de validación de la información publicada con el formato día/mes/año",1,1]
[null,null,"Criterio 18. Nota. Este criterio se cumple en caso de que sea necesario que el sujeto obligado incluya alguna aclaración relativa a la información publicada y/o explicación por la falta de información",1,1]
[null,null,"Criterio 19. La información publicada se organiza mediante los formatos 40a y 40b, en los que se incluyen todos los campos especificados en los criterios sustantivos de contenido",1,1]
[null,null,"Criterio 20. El soporte de la información permite su reutilización",1,1]
{"$rows_empty":7}
[{"$nulls":3},2017,2018]
[null,null,"CS",{"$f":"IF(Aplicabilidad!G51<>\"SI\",\"NA\",SUM(E19:E27)/SUM(D19:D27))","v":{"$error":"#DIV/0!"}},{"$f":"IF(Aplicabilidad!G51<>\"SI\",\"NA\",SUM(E35:E45)/SUM(D35:D45))","v":{"v":1,"d":"100.00%"}}]
[null,null,"CA",{"$f":"IF(Aplicabilidad!G51<>\"SI\",\"NA\",SUM(#REF!)/SUM(#REF!))","v":{"$error":"#REF!"}},{"$f":"IF(Aplicabilidad!G51<>\"SI\",\"NA\",SUM(E50:E58)/SUM(D50:D58))","v":{"v":1,"d":"100.00%"}}]
[null,null,"OBLIGACIÓN",{"$f":"IF(Aplicabilidad!G51<>\"SI\",\"NA\",D67*0.6+D68*0.4)","v":{"$error":"#DIV/0!"}},{"$f":"IF(Aplicabilidad!G51<>\"SI\",\"NA\",E67*0.6+E68*0.4)","v":{"v":1,"d":"100.00%"}}]

{"sheet":"Art 74_XLI","index":43,"n_rows":108,"n_cols":7,"rows_kept":108,"hidden":true,"merged":[[0,2,0,6],[4,1,4,7],[14,4,14,6],[64,4,64,6]]}
[null,null,{"$f":"IF(Aplicabilidad!E2=\"\",\"\",Aplicabilidad!E2)","v":"Consejería Jurídica"}]
[]
[null,"Códigos de valoración : Cumplió totalmente = 1; Cumplió parcialmente = 0.5; No cumplió = 0; Justificado = Justificado"]
[]
[null,"Art. 74 - Fracción XLI. Estudios pagados con recursos públicos"]
[]
[null,null,"Fecha de Inicio de la Verificación:",{"$nulls":3},"Fecha de Término de la verificación"]
[null,null,{"$f":"IF(Resultados!$C$7=\"\",\"\",Resultados!$C$7)","v":"2021-07-07"},"2018-05-25",null,null,{"$f":"IF(Resultados!G7=\"\",\"\",Resultados!G7)","v":"2021-07-08"}]
[]
[null,null,"Criterios Sustantivos",null,{"$f":"IF(Aplicabilidad!G52<>\"SI\",\"NA\",(SUM(E19:E61)+SUM(E69:E84))/(SUM(D19:D61)+SUM(D69:D84)))","v":"NA"}]
[null,null,"Criterios Adjetivos",null,{"$f":"IF(Aplicabilidad!G52<>\"SI\",\"NA\",(SUM(E89:E97))/(SUM(D89:D97)))","v":"NA"}]
[null,null,"Obligación",null,{"$f":"IF(Aplicabilidad!G52<>\"SI\",\"NA\",E10*0.6+E11*0.4)","v":"NA"}]
[]
[]
[]
[null,null,"Criterios Sustantivos de contenido \nLTG 2018 - LTG 2020 (DOF 28/12/20) ",{"$f":"COUNTA(F19:F62)","v":0}]
[]
[null,null,"Criterio",null,"Valoración","Tipo","Observaciones, Recomendaciones y/o Requerimientos"]
[null,null,"Criterio 1. Ejercicio",{"$f":"IF(E19=\"Justificado\",0,1)","v":1}]
[null,null,"Criterio 2. Título del estudio, investigación o análisis elaborado por las áreas administrativas del sujeto obligado, así como de aquellos realizados en colaboración con instituciones u organismos públicos, en su caso",{"$f":"IF(E20=\"Justificado\",0,1)","v":1}]
[null,null,"Criterio 3. Hipervínculo a los documentos que conforman el estudio, investigación o análisis",1]
[null,null,"Criterio 4. Nombre del Área(s) administrativa(s) al interior del sujeto obligado que fue responsable de la elaboración o coordinación del estudio, investigación o análisis",1]
[null,null,"Criterio 5. Nombre del Área(s) administrativa(s) al interior de una institución u organismo públicos; de la institución(es) u organismo(s) públicos; del Instituto(s) o Centro(s) de estudios, de investigación o estadístico, entre otros, de carácter nacional, que colaboró en la elaboración del estudio, investigación o análisis",1]
[null,null,"Criterio 6. ISBN (Número Internacional Normalizado del Libro, por su traducción al español) en caso de que el estudio, investigación o análisis hubiere sido publicado en un libro; ISSN (Número Internacional Normalizado de Publicaciones Seriadas, por su traducción al español) si lo hubiere sido en una publicación seriada, como una revista de investigación",1]
[null,null,"Criterio 7. Objeto del estudio, investigación o análisis (200 caracteres máximo)",1]
[null,null,"Criterio 8. Autor(es) intelectual(es) del estudio, investigación o análisis (nombre[s], primer apellido, segundo apellido)",1]
[null,null,"Criterio 9. Fecha de publicación del estudio, investigación o análisis, con el formato mes/año",1]
[null,null,"Criterio 10. Número de edición para aquellos estudios, investigaciones o análisis publicados en libro",1]
[null,null,"Criterio 11. Lugar de publicación (indicar el nombre de la ciudad)",1]
[null,null,"Criterio 12. Hipervínculo a los convenios de colaboración, coordinación o figuras análogas celebrados por el sujeto obligado con el fin de elaborar los estudios. En caso de que no se haya celebrado alguno, especificarlo mediante leyenda fundamentada y motivada",1]
[null,null,"Criterio 13. Monto total de los recursos públicos y recursos privados destinados a la elaboración del estudio (en Pesos mexicanos)",1]
[null,null,"Criterio 14. Ejercicio",1]
[null,null,"Criterio 15. Título del estudio, investigación o análisis elaborado por el sujeto obligado en colaboración con organizaciones de los sectores social y privado, así como con personas físicas",1]
[null,null,"Criterio 16. Hipervínculo a la consulta de los documentos que conforman el estudio, investigación o análisis",1]
[null,null,"Criterio 17. Nombre del Área(s) administrativa(s) al interior del sujeto obligado que fue responsable de la coordinación del estudio, investigación o análisis",1]
[null,null,"Criterio 18. Denominación de la organización perteneciente a los sectores social o privado, o nombre de la persona física, de carácter nacional o extranjero, que colaboró en la elaboración del estudio, investigación o análisis",1]
[null,null,"Criterio 19. ISBN (Número Internacional Normalizado del Libro, por su traducción al español) en caso de que el estudio, investigación o análisis hubiere sido publicado en un libro; ISSN (Número Internacional Normalizado de Publicaciones Seriadas, por su traducción al español) si lo hubiere sido en una publicación seriada, como una revista de investigación",1]
[null,null,"Criterio 20. Objeto del estudio, investigación o análisis (150 caracteres máximo)",1]
[null,null,"Criterio 21. Autor(es) intelectual(es) del estudio, investigación o análisis (nombre[s], primer apellido, segundo apellido)",1]
[null,null,"Criterio 22. Fecha de publicación del estudio, investigación o análisis, con el formato mes/año",1]
[null,null,"Criterio 23. Número de edición (para aquellos estudios, investigaciones o análisis publicados en libro)",1]
[null,null,"Criterio 24. Lugar de publicación (indicar el nombre de la ciudad)",1]
[null,null,"Criterio 25. Hipervínculo a los convenios de colaboración, coordinación o figuras análogas celebrados por el sujeto obligado con las organizaciones pertenecientes a los sectores social o privado, o las personas físicas que colaboraron en la elaboración del estudio",1]
[null,null,"Criterio 26. Monto total de los recursos públicos y recursos privados destinados a la elaboración del estudio (pesos mexicanos)",1]
[null,null,"Criterio 27. Ejercicio",1]
[null,null,"Criterio 28. Título del estudio, investigación o análisis para cuya realización se haya contratado a organizaciones pertenecientes a los sectores social y privado, instituciones u organismos públicos, o personas físicas",1]
[null,null,"Criterio 29. Hipervínculo a la consulta de los documentos que conforman el estudio, investigación o análisis",1]
[null,null,"Criterio 30. Nombre del Área(s) administrativa(s) al interior del sujeto obligado que fue responsable de la coordinación del estudio, investigación o análisis",1]
[null,null,"Criterio 31. Nombre del Área(s) administrativa(s) al interior del sujeto obligado que fue responsable de la contratación del estudio, investigación o análisis con un tercero",1]
[null,null,"Criterio 32. Denominación de la organización de los sectores social o privado, la institución u organismo público, o nombre de la persona física, de carácter nacional o extranjero, contratada para la elaboración completa o parcial del estudio",1]
[null,null,"Criterio 33. ISBN (Número Internacional Normalizado del Libro, por su traducción al español) en caso de que el estudio, investigación o análisis hubiere sido publicado en un libro; ISSN (Número Internacional Normalizado de Publicaciones Seriadas, por su traducción al español) si lo hubiere sido en una publicación seriada, como una revista de investigación",1]
[null,null,"Criterio 34. Objeto del estudio, investigación o análisis (150 caracteres máximo)",1]
[null,null,"Criterio 35. Autor(es) intelectual(es) de los estudios, investigaciones o análisis contratados (nombre[s], primer apellido, segundo apellido)",1]
[null,null,"Criterio 36. Fecha de publicación del estudio, investigación o análisis, con el formato mes/año",1]
[null,null,"Criterio 37. Número de edición para aquellos estudios, investigaciones o análisis publicados en libro",1]
[null,null,"Criterio 38. Lugar de publicación (indicar el nombre de la ciudad)",1]
[null,null,"Criterio 39. Hipervínculo a los contratos o figuras análogas celebrados por el sujeto obligado con las organizaciones de los sectores social o privado, instituciones u organismos públicos, o personas físicas que fueron contratadas para la elaboración completa o parcial del estudio",1]
[null,null,"Criterio 40. Monto total de los recursos públicos y privados destinados al pago de la elaboración del estudio que hayan realizado organizaciones de los sectores social o privado, instituciones u organismos públicos, o personas físicas",1]
[null,null,"Criterio 41. Ejercicio",1]
[null,null,"Criterio 42. Leyenda que señale que se elaboraron estudios, investigaciones o análisis financiados con recursos públicos, a solicitud de algún(os) otro(s) sujeto(s) obligado(s)",{"$f":"IF(E60=\"Justificado\",0,1)","v":1}]
[null,null,"Criterio 43. Lista de sujetos obligados que financiaron dichos estudios e hipervínculo a esta fracción en sus portales de obligaciones de transparencia",{"$f":"IF(E61=\"Justificado\",0,1)","v":1}]
[]
[]
[]
[]
[null,null,"Criterios Sustantivos de contenido LTG 2018 - LTG 2020 (DOF 28/12/20) ",{"$f":"COUNTA(F69:F97)","v":1}]
[]
[null,null,"Criterio",null,"Valoración","Tipo","Observaciones, Recomendaciones y/o Requerimientos"]
[null,null,"Criterio 1. Ejercicio",{"$f":"IF(E69=\"Justificado\",0,1)","v":1}]
[null,null,"Criterio 2. Periodo que se informa (fecha de inicio y fecha de término con el formato día/mes/año)",{"$f":"IF(E70=\"Justificado\",0,1)","v":1}]
[null,null,"Criterio 3. Forma y actores participantes en la elaboración del estudio (catálogo): Realizado por el sujeto obligado/Realizado en colaboración con instituciones u organismos públicos/Realizado en colaboración con organizaciones del sector social y privado y/o personas físicas/Realizado a solicitud del sujeto obligado a organizaciones del sector público, social, privado o personas físicas",1]
[null,null,"Criterio 4. Título del estudio",1]
[null,null,"Criterio 5. Área(s) al interior del sujeto obligado que fue responsable de la elaboración o coordinación del estudio",1]
[null,null,"Criterio 6. Denominación de la institución u organismo público o privado, que en su caso, colaboró en la elaboración del estudio",1]
[null,null,"Criterio 7. ISBN[1] o ISSN[2], en su caso. ",1]
[null,null,"Criterio 8. Objeto del estudio",1]
[null,null,"Criterio 9. Autor(es) intelectual(es) del estudio (nombre[s], primer apellido, segundo apellido, denominación)",1]
[null,null,"Criterio 10. Fecha de publicación del estudio con el formato día/mes/año",1]
[null,null,"Criterio 11. Número de edición para aquellos estudios, publicados en libro",1]
[null,null,"Criterio 12. Lugar de publicación (indicar el nombre de la ciudad)",1]
[null,null,"Criterio 13. Hipervínculo a los contratos, convenios de colaboración, coordinación o figuras análogas celebrados por el sujeto obligado con el fin de elaborar los estudios. En caso de que no se haya celebrado alguno, deberá especificarlo. ",1]
[null,null,"Criterio 14. Monto total de los recursos públicos destinados a la elaboración del estudio (en Pesos mexicanos)",1]
[null,null,"Criterio 15. Monto total de los recursos privados destinados a la elaboración del estudio (en Pesos mexicanos)",{"$f":"IF(E83=\"Justificado\",0,1)","v":1}]
[null,null,"Criterio 16. Hipervínculo a los documentos que conforman el estudio",{"$f":"IF(E84=\"Justificado\",0,1)","v":1}]
[]
[null,null,"Criterios Adjetivos LTG 2018 - LTG 2020 (DOF 28/12/20) "]
[]
[null,null,"Criterio",null,"Valoración","Tipo","Observaciones, Recomendaciones y/o Requerimientos"]
[null,null,"Criterio 17. Periodo de actualización de la información: trimestral. En su caso, 30 días hábiles después de publicar los resultados del estudio",{"$f":"IF(E89=\"Justificado\",0,1)","v":1}]
[null,null,"Criterio 18. La información deberá estar actualizada al periodo que corresponde de acuerdo con la Tabla de actualización y conservación de la información",1]
[null,null,"Criterio 19. Conservar en el sitio de Internet y a través de la Plataforma Nacional la información de acuerdo con la Tabla de actualización y conservación de la información",1]
[null,null,"Criterio 20. Área(s) responsable(s) que genera(n), posee(n), publica(n) y/o actualiza(n) la información ",1]
[null,null,"Criterio 21. Fecha de actualización de la información publicada con el formato día/mes/año",1]
[null,null,"Criterio 22. Fecha de validación de la información publicada con el formato día/mes/año",1]
[null,null,"Criterio 23. Nota. Este criterio se cumple en caso de que sea necesario que el sujeto obligado incluya alguna aclaración relativa a la información publicada y/o explicación por la falta de información ",1]
[null,null,"Criterio 24. La información publicada se organiza mediante el formato 41, en el que se incluyen todos los campos especificados en los criterios sustantivos de contenido",1]
[null,null,"Criterio 25. El soporte de la información permite su reutilización",1]
{"$rows_empty":7}
[{"$nulls":3},2017,2018]
[null,null,"CS",{"$f":"IF(Aplicabilidad!G52<>\"SI\",\"NA\",SUM(E19:E61)/SUM(D19:D61))","v":"NA"},{"$f":"IF(Aplicabilidad!G52<>\"SI\",\"NA\",SUM(E69:E84)/SUM(D69:D84))","v":"NA"}]
[null,null,"CA",{"$f":"IF(Aplicabilidad!G52<>\"SI\",\"NA\",SUM(#REF!)/SUM(#REF!))","v":"NA"},{"$f":"IF(Aplicabilidad!G52<>\"SI\",\"NA\",SUM(E89:E97)/SUM(D89:D97))","v":"NA"}]
[null,null,"OBLIGACIÓN",{"$f":"IF(Aplicabilidad!G52<>\"SI\",\"NA\",D106*0.6+D107*0.4)","v":"NA"},{"$f":"IF(Aplicabilidad!G52<>\"SI\",\"NA\",E106*0.6+E107*0.4)","v":"NA"}]

{"sheet":"Art 74_XLII","index":44,"n_rows":69,"n_cols":7,"rows_kept":69,"hidden":true,"merged":[[0,2,0,6],[4,1,4,7],[14,4,14,6],[30,4,30,6]]}
[null,null,{"$f":"IF(Aplicabilidad!E2=\"\",\"\",Aplicabilidad!E2)","v":"Consejería Jurídica"}]
[]
[null,"Códigos de valoración : Cumplió totalmente = 1; Cumplió parcialmente = 0.5; No cumplió = 0; Justificado = Justificado"]
[]
[null,"Art. 74 - Fracción XLII. Pagos a jubilados y pensionados"]
[]
[null,null,"Fecha de Inicio de la Verificación:",{"$nulls":3},"Fecha de Término de la verificación"]
[null,null,{"$f":"IF(Resultados!$C$7=\"\",\"\",Resultados!$C$7)","v":"2021-07-07"},"2018-05-25",null,null,{"$f":"IF(Resultados!G7=\"\",\"\",Resultados!G7)","v":"2021-07-08"}]
[]
[null,null,"Criterios Sustantivos",null,{"$f":"IF(Aplicabilidad!G53<>\"SI\",\"NA\",(SUM(E19:E27)+SUM(E35:E45))/(SUM(D19:D27)+SUM(D35:D45)))","v":"NA"}]
[null,null,"Criterios Adjetivos",null,{"$f":"IF(Aplicabilidad!G53<>\"SI\",\"NA\",(SUM(E50:E58))/(SUM(D50:D58)))","v":"NA"}]
[null,null,"Obligación",null,{"$f":"IF(Aplicabilidad!G53<>\"SI\",\"NA\",E10*0.6+E11*0.4)","v":"NA"}]
[]
[]
[]
[null,null,"Criterios Sustantivos de contenido \nLTG 2018 - LTG 2020 (DOF 28/12/20) ",{"$f":"COUNTA(F19:F28)","v":0}]
[]
[null,null,"Criterio",null,"Valoración","Tipo","Observaciones, Recomendaciones y/o Requerimientos"]
[null,null,"Criterio 1. Leyenda: El listado de jubilados y pensionados es generado y publicado por: << el instituto de seguridad social encargado de administrar las cuentas para el retiro de los jubilados y pensionados del sujeto obligado>>",{"$f":"IF(E19=\"Justificado\",0,1)","v":1}]
[null,null,"Criterio 2. Hipervínculo al sitio en Internet donde los institutos de seguridad social publiquen los listados de jubilados y pensionados de los sujetos obligados, así como el monto de la porción de su pensión que reciben directamente del Estado Mexicano",{"$f":"IF(E20=\"Justificado\",0,1)","v":1}]
[null,null,"Criterio 3. Ejercicio",1]
[null,null,"Criterio 4. Denominación del sujeto obligado",1]
[null,null,"Criterio 5. Periodo que se informa",1]
[null,null,"Criterio 6. Estatus: jubilado(a), pensionado(a)",1]
[null,null,"Criterio 7. Nombre completo del jubilado(a) o pensionado(a) (nombre[s], primer apellido, segundo apellido)",1]
[null,null,"Criterio 8. Monto de la pensión",{"$f":"IF(E26=\"Justificado\",0,1)","v":1}]
[null,null,"Criterio 9. Periodicidad de la pensión (quincenal, mensual, bimestral, trimestral, semestral, anual)",{"$f":"IF(E27=\"Justificado\",0,1)","v":1}]
[]
[]
[]
[]
[null,null,"Criterios Sustantivos de contenido LTG 2018 - LTG 2020 (DOF 28/12/20) ",{"$f":"COUNTA(F35:F58)","v":1}]
[]
[null,null,"Criterio",null,"Valoración","Tipo","Observaciones, Recomendaciones y/o Requerimientos"]
[null,null,"Criterio 1. Ejercicio",{"$f":"IF(E35=\"Justificado\",0,1)","v":1}]
[null,null,"Criterio 2 . Periodo que se informa (fecha de inicio y fecha de término con el formato día/mes/año)",{"$f":"IF(E36=\"Justificado\",0,1)","v":1}]
[null,null,"Criterio 3. Mensaje: El listado de jubilados y pensionados es generado y publicado por el [indicar el nombre del Instituto de seguridad social] como parte de las prestaciones de Ley que derivan del esquema de Seguridad Social previsto en la Ley [especificar la normatividad que regula al Instituto], toda vez que el (la) [especificar nombre de sujeto obligado] no tiene un esquema propio de jubilaciones y pensiones",1]
[null,null,"Criterio 4. Hipervínculo a la sección del Sistema de Portales de Obligaciones de Transparencia en donde los institutos de seguridad social publiquen los listados de jubilados y pensionados. - Criterio modificado DOF 28/12/2020",1]
[null,null,"Criterio 5. Ejercicio",1]
[null,null,"Criterio 6. Periodo que se informa (fecha de inicio y fecha de término con el formato día/mes/año)",1]
[null,null,"Criterio 7. Estatus (catálogo): Jubilado(a)/ Pensionado(a)/ Haber de retiro/ Otro",1]
[null,null,"Criterio 8. Tipo de jubilación o pensión. Por ejemplo: años de servicio, vejez, cesantía en edad avanzada, invalidez, incapacidad permanente total, incapacidad permanente parcial, viudez, orfandad, viudez y orfandad, ascendientes.",1]
[null,null,"Criterio 9. Nombre completo del jubilado(a) o pensionado(a) (nombre[s], primer apellido, segundo apellido)",1]
[null,null,"Criterio 10. Monto de la porción de su pensión que recibe directamente del Estado Mexicano",{"$f":"IF(E44=\"Justificado\",0,1)","v":1}]
[null,null,"Criterio 11. Periodicidad de la pensión (quincenal, mensual, bimestral, trimestral, semestral, anual)",{"$f":"IF(E45=\"Justificado\",0,1)","v":1}]
[]
[null,null,"Criterios Adjetivos LTG 2018 - LTG 2020 (DOF 28/12/20) "]
[]
[null,null,"Criterio",null,"Valoración","Tipo","Observaciones, Recomendaciones y/o Requerimientos"]
[null,null,"Criterio 12. Periodo de actualización de la información: trimestral",{"$f":"IF(E50=\"Justificado\",0,1)","v":1}]
[null,null,"Criterio 13. La información deberá estar actualizada al periodo que corresponde de acuerdo con la Tabla de actualización y conservación de la información",1]
[null,null,"Criterio 14. Conservar en el sitio de Internet: Respecto de los sujetos obligados que no son instituciones de seguridad social, se conservará información vigente.\nEn cuanto a las instituciones de seguridad social o que pagan jubilaciones o pensiones de forma directa a sus trabajadores, información del ejercicio en curso y la correspondiente al ejercicio anterior. - Párrafo modificado DOF 28/12/2020",1]
[null,null,"Criterio 15. Área(s) responsable(s) que genera(n), posee(n), publica(n) y/o actualiza(n) la información",1]
[null,null,"Criterio 16. Fecha de actualización de la información publicada con el formato día/mes/año",1]
[null,null,"Criterio 17. Fecha de validación de la información publicada con el formato día/mes/año ",1]
[null,null,"Criterio 18 . Nota. Este criterio se cumple en caso de que sea necesario que el sujeto obligado incluya alguna aclaración relativa a la información publicada y/o explicación por la falta de información",1]
[null,null,"Criterio 19. La información publicada se organiza mediante los formatos 42a y 42b, en los que se incluyen todos los campos especificados en los criterios sustantivos de contenido",1]
[null,null,"Criterio 20. El soporte de la información permite su reutilización",1]
{"$rows_empty":7}
[{"$nulls":3},2017,2018]
[null,null,"CS",{"$f":"IF(Aplicabilidad!G53<>\"SI\",\"NA\",SUM(E19:E27)/SUM(D19:D27))","v":"NA"},{"$f":"IF(Aplicabilidad!G53<>\"SI\",\"NA\",SUM(E35:E45)/SUM(D35:D45))","v":"NA"}]
[null,null,"CA",{"$f":"IF(Aplicabilidad!G53<>\"SI\",\"NA\",SUM(#REF!)/SUM(#REF!))","v":"NA"},{"$f":"IF(Aplicabilidad!G53<>\"SI\",\"NA\",SUM(E50:E58)/SUM(D50:D58))","v":"NA"}]
[null,null,"OBLIGACIÓN",{"$f":"IF(Aplicabilidad!G53<>\"SI\",\"NA\",D67*0.6+D68*0.4)","v":"NA"},{"$f":"IF(Aplicabilidad!G53<>\"SI\",\"NA\",E67*0.6+E68*0.4)","v":"NA"}]

{"sheet":"Art 74_XLIII","index":45,"n_rows":80,"n_cols":7,"rows_kept":80,"hidden":true,"merged":[[0,2,0,6],[4,1,4,7],[14,4,14,6],[35,4,35,6]]}
[null,null,{"$f":"IF(Aplicabilidad!E2=\"\",\"\",Aplicabilidad!E2)","v":"Consejería Jurídica"}]
[]
[null,"Códigos de valoración : Cumplió totalmente = 1; Cumplió parcialmente = 0.5; No cumplió = 0; Justificado = Justificado"]
[]
[null,"Art. 74 - Fracción XLIII. Ingresos totales del sujeto obligado"]
[]
[null,null,"Fecha de Inicio de la Verificación:",{"$nulls":3},"Fecha de Término de la verificación"]
[null,null,{"$f":"IF(Resultados!$C$7=\"\",\"\",Resultados!$C$7)","v":"2021-07-07"},"2018-05-25",null,null,{"$f":"IF(Resultados!G7=\"\",\"\",Resultados!G7)","v":"2021-07-08"}]
[]
[null,null,"Criterios Sustantivos",null,{"$f":"IF(Aplicabilidad!G54<>\"SI\",\"NA\",(SUM(E19:E32)+SUM(E40:E56))/(SUM(D19:D32)+SUM(D40:D56)))","v":"NA"}]
[null,null,"Criterios Adjetivos",null,{"$f":"IF(Aplicabilidad!G54<>\"SI\",\"NA\",(SUM(E61:E69))/(SUM(D61:D69)))","v":"NA"}]
[null,null,"Obligación",null,{"$f":"IF(Aplicabilidad!G54<>\"SI\",\"NA\",E10*0.6+E11*0.4)","v":"NA"}]
[]
[]
[]
[null,null,"Criterios Sustantivos de contenido \nLTG 2018 - LTG 2020 (DOF 28/12/20) ",{"$f":"COUNTA(F19:F33)","v":0}]
[]
[null,null,"Criterio",null,"Valoración","Tipo","Observaciones, Recomendaciones y/o Requerimientos"]
[null,null,"Criterio 1. Ejercicio",{"$f":"IF(E19=\"Justificado\",0,1)","v":0},"Justificado"]
[null,null,"Criterio 2. Periodo que se informa",{"$f":"IF(E20=\"Justificado\",0,1)","v":0},"Justificado"]
[null,null,"Criterio 3. Concepto de los ingresos con base en las disposiciones aplicables en la materia",0,"Justificado"]
[null,null,"Criterio 4. Fuente de los ingresos: Gobierno Federal/Organismos y Empresas/Derivados de financiamientos/Otra",0,"Justificado"]
[null,null,"Criterio 5. Denominación de la entidad o dependencia que entregó los ingresos",0,"Justificado"]
[null,null,"Criterio 6. Monto de los ingresos por concepto",0,"Justificado"]
[null,null,"Criterio 7. Fecha de los ingresos recibidos con el formato día, mes, año (por ej. 31/Marzo/2016)",0,"Justificado"]
[null,null,"Criterio 8. Destino de los ingresos recibidos (hipervínculo a los informes de avance trimestral u homólogos en donde se especifique el destino de los recursos)",0,"Justificado"]
[null,null,"Criterio 9. Nombre(s), primer apellido, segundo apellido de los responsables de recibir los ingresos",0,"Justificado"]
[null,null,"Criterio 10. Cargo de los(as) servidores(as) públicos(as) y/o toda persona que desempeñe un cargo o comisión y/o ejerza actos de autoridad y sea responsables de recibir los ingresos",0,"Justificado"]
[null,null,"Criterio 11. Nombre(s), primer apellido, segundo apellido de los responsables de administrar los ingresos",0,"Justificado"]
[null,null,"Criterio 12. Cargo de los(as) servidores(as) públicos(as) y/o toda persona que desempeñe un cargo o comisión y/o ejerza actos de autoridad y sea responsables de administrar los recursos",0,"Justificado"]
[null,null,"Criterio 13. Nombre(s), primer apellido, segundo apellido de los(as) servidores(as) públicos(as) y/o toda persona que desempeñe un cargo o comisión y/o ejerza actos de autoridad y sea responsables de ejercer los ingresos",{"$f":"IF(E31=\"Justificado\",0,1)","v":0},"Justificado"]
[null,null,"Criterio 14. Cargo de los(as) servidores(as) públicos(as) y/o toda persona que desempeñe un cargo o comisión y/o ejerza actos de autoridad y sea responsables de ejercerlos",{"$f":"IF(E32=\"Justificado\",0,1)","v":0},"Justificado"]
[]
[]
[]
[]
[null,null,"Criterios Sustantivos de contenido \nLTG 2018 - LTG 2020 (DOF 28/12/20) ",{"$f":"COUNTA(F40:F69)","v":1}]
[]
[null,null,"Criterio",null,"Valoración","Tipo","Observaciones, Recomendaciones y/o Requerimientos"]
[null,null,"Criterio 1. Ejercicio",{"$f":"IF(E40=\"Justificado\",0,1)","v":1}]
[null,null,"Criterio 2. Periodo que se informa (fecha de inicio y fecha de término con el formato día/mes/año)",{"$f":"IF(E41=\"Justificado\",0,1)","v":1}]
[null,null,"Criterio 3. Rubro de los ingresos con base en las disposiciones aplicables en la materia",1]
[null,null,"Criterio 4. Tipo de ingresos con base en las disposiciones aplicables en la materia",1]
[null,null,"Criterio 5. Monto de los ingresos ",1]
[null,null,"Criterio 6. Fuente de los ingresos. Por ejemplo: Gobierno Federal, Organismos y Empresas, Derivados de financiamientos",1]
[null,null,"Criterio 7. Denominación de la entidad o dependencia que entregó los ingresos",1]
[null,null,"Criterio 8. Fecha de los ingresos recibidos con el formato día/mes/año ",1]
[null,null,"Criterio 9. Hipervínculo al informe de destino de los ingresos recibidos (Informe de avance trimestral u homólogo) ",1]
[null,null,"Criterio 10. Ejercicio",1]
[null,null,"Criterio 11. Periodo que se informa (fecha de inicio y fecha de término con el formato día/mes/año)",1]
[null,null,"Criterio 12. Nombre(s), primer apellido, segundo apellido de los responsables de recibir los ingresos",1]
[null,null,"Criterio 13. Cargo de los(as) servidores(as) públicos(as) y/o toda persona que desempeñe un cargo o comisión y/o ejerza actos de autoridad y sea responsables de recibir los ingresos",1]
[null,null,"Criterio 14. Nombre(s), primer apellido, segundo apellido de los responsables de administrar los ingresos",1]
[null,null,"Criterio 15. Cargo de los(as) servidores(as) públicos(as) y/o toda persona que desempeñe un cargo o comisión y/o ejerza actos de autoridad y sea responsables de administrar los recursos",1]
[null,null,"Criterio 16. Nombre(s), primer apellido, segundo apellido de los(as) servidores(as) públicos(as) y/o toda persona que desempeñe un cargo o comisión y/o ejerza actos de autoridad y sea responsables de ejercer los ingresos",{"$f":"IF(E55=\"Justificado\",0,1)","v":1}]
[null,null,"Criterio 17. Cargo de los(as) servidores(as) públicos(as) y/o toda persona que desempeñe un cargo o comisión y/o ejerza actos de autoridad y sea responsables de ejercerlos",{"$f":"IF(E56=\"Justificado\",0,1)","v":1}]
[]
[null,null,"Criterios Adjetivos LTG 2018 - LTG 2020 (DOF 28/12/20) "]
[]
[null,null,"Criterio",null,"Valoración","Tipo","Observaciones, Recomendaciones y/o Requerimientos"]
[null,null,"Criterio 18. Periodo de actualización de la información: trimestral",{"$f":"IF(E61=\"Justificado\",0,1)","v":1}]
[null,null,"Criterio 19. La información deberá estar actualizada al periodo que corresponde de acuerdo con la Tabla de actualización y conservación de la información",1]
[null,null,"Criterio 20. Conservar en el sitio de Internet: información del ejercicio en curso y la correspondiente a dos ejercicios anteriores - Párrafo modificado DOF 28/12/2020",1]
[null,null,"Criterio 21. Área(s) responsable(s) que genera(n), posee(n), publica(n) y actualiza(n)  la información ",1]
[null,null,"Criterio 22. Fecha de actualización de la información publicada con el formato día/mes/año",1]
[null,null,"Criterio 23. Fecha de validación de la información publicada con el formato día/mes/año",1]
[null,null,"Criterio 24. Nota. Este criterio se cumple en caso de que sea necesario que el sujeto obligado incluya alguna aclaración relativa a la información publicada y/o explicación por la falta de información",1]
[null,null,"Criterio 25. La información publicada se organiza mediante los formatos 43a y 43b, en los que se incluyen todos los campos especificados en los criterios sustantivos de contenido",1]
[null,null,"Criterio 26. El soporte de la información permite su reutilización",1]
{"$rows_empty":7}
[{"$nulls":3},2017,2018]
[null,null,"CS",{"$f":"IF(Aplicabilidad!G54<>\"SI\",\"NA\",SUM(E19:E32)/SUM(D19:D32))","v":"NA"},{"$f":"IF(Aplicabilidad!G54<>\"SI\",\"NA\",SUM(E40:E56)/SUM(D40:D56))","v":"NA"}]
[null,null,"CA",{"$f":"IF(Aplicabilidad!G54<>\"SI\",\"NA\",SUM(#REF!)/SUM(#REF!))","v":"NA"},{"$f":"IF(Aplicabilidad!G54<>\"SI\",\"NA\",SUM(E61:E69)/SUM(D61:D69))","v":"NA"}]
[null,null,"OBLIGACIÓN",{"$f":"IF(Aplicabilidad!G54<>\"SI\",\"NA\",D78*0.6+D79*0.4)","v":"NA"},{"$f":"IF(Aplicabilidad!G54<>\"SI\",\"NA\",E78*0.6+E79*0.4)","v":"NA"}]

{"sheet":"Art 74_XLIV","index":46,"n_rows":95,"n_cols":7,"rows_kept":95,"hidden":true,"merged":[[0,2,0,6],[4,1,4,7],[14,4,14,6],[44,4,44,6]]}
[null,null,{"$f":"IF(Aplicabilidad!E2=\"\",\"\",Aplicabilidad!E2)","v":"Consejería Jurídica"}]
[]
[null,"Códigos de valoración : Cumplió totalmente = 1; Cumplió parcialmente = 0.5; No cumplió = 0; Justificado = Justificado"]
[]
[null,"Art. 74 - Fracción XLIV. Donaciones en dinero o en especie"]
[]
[null,null,"Fecha de Inicio de la Verificación:",{"$nulls":3},"Fecha de Término de la verificación"]
[null,null,{"$f":"IF(Resultados!$C$7=\"\",\"\",Resultados!$C$7)","v":"2021-07-07"},"2018-05-25",null,null,{"$f":"IF(Resultados!G7=\"\",\"\",Resultados!G7)","v":"2021-07-08"}]
[]
[null,null,"Criterios Sustantivos",null,{"$f":"IF(Aplicabilidad!G55<>\"SI\",\"NA\",(SUM(E19:E41)+SUM(E49:E71))/(SUM(D19:D41)+SUM(D49:D71)))","v":"NA"}]
[null,null,"Criterios Adjetivos",null,{"$f":"IF(Aplicabilidad!G55<>\"SI\",\"NA\",(SUM(E76:E84))/(SUM(D76:D84)))","v":"NA"}]
[null,null,"Obligación",null,{"$f":"IF(Aplicabilidad!G55<>\"SI\",\"NA\",E10*0.6+E11*0.4)","v":"NA"}]
[]
[]
[]
[null,null,"Criterios Sustantivos de contenido \nLTG 2018 - LTG 2020 (DOF 28/12/20) ",{"$f":"COUNTA(F19:F42)","v":0}]
[]
[null,null,"Criterio",null,"Valoración","Tipo","Observaciones, Recomendaciones y/o Requerimientos"]
[null,null,"Criterio 1. Ejercicio",{"$f":"IF(E19=\"Justificado\",0,1)","v":1}]
[null,null,"Criterio 2. Periodo que se reporta",{"$f":"IF(E20=\"Justificado\",0,1)","v":1}]
[null,null,"Criterio 3. Personería jurídica de la parte donataria: Persona física / Persona moral (Asociaciones no lucrativas; fideicomisos constituidos por las entidades federativas; fideicomisos constituidos por particulares; entidades federativas; municipios; organismos territoriales de la Ciudad de México; organismos e instituciones internacionales; otro)",1]
[null,null,"Criterio 4. Nombre(s), primer apellido, segundo apellido del beneficiario de la donación (persona física) o razón social (persona moral)",1]
[null,null,"Criterio 5. Nombre de la persona física facultada por el beneficiario para suscribir el contrato de donación",1]
[null,null,"Criterio 6. Cargo que ocupa",1]
[null,null,"Criterio 7. Nombre del(a) servidor(a) público(a) y/o toda persona que desempeñe un cargo o comisión y/o ejerza actos de autoridad, facultada por el sujeto obligado donante para suscribir el contrato de donación",1]
[null,null,"Criterio 8. Cargo o nombramiento del servidor público",1]
[null,null,"Criterio 9. Monto otorgado",1]
[null,null,"Criterio 10. Actividades a las que se destinará: Educativas/Culturales/De salud/De investigación científica/De aplicación de nuevas tecnologías/De beneficencia/Otras (especificar)",1]
[null,null,"Criterio 11. Hipervínculo al contrato de donación, protegiendo datos personales del beneficiario, mediante resolución del Comité de Transparencia",1]
[null,null,"Criterio 12. Ejercicio",1]
[null,null,"Criterio 13. Periodo que se reporta",1]
[null,null,"Criterio 14. Descripción del bien donado",1]
[null,null,"Criterio 15. Actividades a las que se destinará la donación: Educativas/Culturales/ De salud/De investigación científica/De aplicación de nuevas tecnologías/ De beneficencia, prestación de servicios sociales, ayuda humanitaria/Otra",1]
[null,null,"Criterio 16. Personería jurídica del beneficiario: Persona física /Persona moral a la cual se le entregó el donativo",1]
[null,null,"Criterio 17. En caso de persona física: Nombre(s), primer apellido, segundo apellido del beneficiario de la donación (persona física)",1]
[null,null,"Criterio 18. En caso de persona moral, especificar tipo: Entidad federativa/Municipio/Institución de salud, beneficencia o asistencia, educativa o cultural/Prestadores de servicios sociales por encargo/Beneficiarios de algún servicio asistencial público, comunidad agraria y ejido, entidad que lo necesite para sus fines/Gobierno o institución extranjera, organización internacional/Otro",1]
[null,null,"Criterio 19. Nombre(s), primer apellido, segundo apellido de la persona física facultada por el beneficiario para suscribir el contrato",1]
[null,null,"Criterio 20. Cargo que ocupa",1]
[null,null,"Criterio 21. Nombre del(a) servidor(a) público(a) y/o toda persona que desempeñe un cargo o comisión y/o ejerza actos de autoridad, facultada por el sujeto obligado para suscribir el contrato",1]
[null,null,"Criterio 22. Cargo o nombramiento del(a) servidor(a) público(a) y/o toda persona que desempeñe un cargo o comisión y/o ejerza actos de autoridad, facultada por el sujeto obligado para suscribir el contrato",{"$f":"IF(E40=\"Justificado\",0,1)","v":1}]
[null,null,"Criterio 23. Hipervínculo al contrato de donación, protegiendo datos personales del beneficiario tratándose de personas físicas",{"$f":"IF(E41=\"Justificado\",0,1)","v":1}]
[]
[]
[]
[]
[null,null,"Criterios Sustantivos de contenido LTG 2018 - LTG 2020 (DOF 28/12/20) ",{"$f":"COUNTA(F49:F84)","v":1}]
[]
[null,null,"Criterio",null,"Valoración","Tipo","Observaciones, Recomendaciones y/o Requerimientos"]
[null,null,"Criterio 1. Ejercicio",{"$f":"IF(E49=\"Justificado\",0,1)","v":1}]
[null,null,"Criterio 2. Periodo que se reporta (fecha de inicio y fecha de término con el formato día/mes/año)",{"$f":"IF(E50=\"Justificado\",0,1)","v":1}]
[null,null,"Criterio 3. Personería jurídica de la parte donataria (catálogo): Persona física/Persona moral (por ejemplo: Asociaciones no lucrativas; fideicomisos constituidos por las entidades federativas; fideicomisos constituidos por particulares; entidades federativas; municipios; organismos territoriales de la Ciudad de México; organismos e instituciones internacionales; otro)",1]
[null,null,"Criterio 4. Nombre(s), primer apellido, segundo apellido del beneficiario de la donación (persona física) o razón social (persona moral)",1]
[null,null,"Criterio 5. Nombre de la persona física facultada por el beneficiario para suscribir el contrato de donación",1]
[null,null,"Criterio 6. Cargo que ocupa",1]
[null,null,"Criterio 7. Nombre del(a) servidor(a) público(a) y/o toda persona que desempeñe un cargo o comisión y/o ejerza actos de autoridad, facultada por el sujeto obligado donante para suscribir el contrato de donación",1]
[null,null,"Criterio 8. Cargo o nombramiento del servidor público",1]
[null,null,"Criterio 9. Monto otorgado",1]
[null,null,"Criterio 10. Actividades a las que se destinará (catálogo): Educativas/Culturales/De salud/De investigación científica/De aplicación de nuevas tecnologías/De beneficencia/Otras",1]
[null,null,"Criterio 11. Hipervínculo al contrato de donación, protegiendo datos personales del beneficiario, mediante resolución del Comité de Transparencia",1]
[null,null,"Criterio 12. Ejercicio",1]
[null,null,"Criterio 13. Periodo que se reporta (fecha de inicio y fecha de término con el formato día/mes/año)",1]
[null,null,"Criterio 14. Descripción del bien donado",1]
[null,null,"Criterio 15. Actividades a las que se destinará la donación (catálogo): Educativas/Culturales/ De salud/De investigación científica/De aplicación de nuevas tecnologías/ De beneficencia, prestación de servicios sociales, ayuda humanitaria/Otra",1]
[null,null,"Criterio 16. Personería jurídica del beneficiario (catálogo): Persona física/Persona moral a la cual se le entregó el donativo",1]
[null,null,"Criterio 17. En caso de persona física: Nombre(s), primer apellido, segundo apellido del beneficiario de la donación; en caso de persona moral: denominación",1]
[null,null,"Criterio 18. Tipo de persona moral, en su caso. Por ejemplo: Institución de salud, beneficencia o asistencia, educativa o cultural, Prestadores de servicios sociales por encargo, Beneficiarios de algún servicio asistencial público, comunidad agraria y ejido, entidad que lo necesite para sus fines, Gobierno o institución extranjera, organización internacional",1]
[null,null,"Criterio 19. Nombre(s), primer apellido, segundo apellido de la persona física facultada por el beneficiario para suscribir el contrato",1]
[null,null,"Criterio 20. Cargo que ocupa",1]
[null,null,"Criterio 21. Nombre del(a) servidor(a) público(a) y/o toda persona que desempeñe un cargo o comisión y/o ejerza actos de autoridad, facultada por el sujeto obligado para suscribir el contrato",1]
[null,null,"Criterio 22. Cargo o nombramiento del(a) servidor(a) público(a) y/o toda persona que desempeñe un cargo o comisión y/o ejerza actos de autoridad, facultada por el sujeto obligado para suscribir el contrato",{"$f":"IF(E70=\"Justificado\",0,1)","v":1}]
[null,null,"Criterio 23. Hipervínculo al contrato de donación, protegiendo datos personales del beneficiario tratándose de personas físicas",{"$f":"IF(E71=\"Justificado\",0,1)","v":1}]
[]
[null,null,"Criterios Adjetivos LTG 2018 - LTG 2020 (DOF 28/12/20) "]
[]
[null,null,"Criterio",null,"Valoración","Tipo","Observaciones, Recomendaciones y/o Requerimientos"]
[null,null,"Criterio 24. Periodo de actualización de la información: semestral",{"$f":"IF(E76=\"Justificado\",0,1)","v":1}]
[null,null,"Criterio 25. La información deberá estar actualizada al periodo que corresponde de acuerdo con la Tabla de actualización y conservación de la información",1]
[null,null,"Criterio 26. Conservar en el sitio de Internet y a través de la Plataforma Nacional la información de acuerdo con la Tabla de actualización y conservación de la información",1]
[null,null,"Criterio 27. Área(s) responsable(s) que genera(n), posee(n), publica(n) y/o actualiza(n) la información ",1]
[null,null,"Criterio 28. Fecha de actualización de la información publicada con el formato día/mes/año",1]
[null,null,"Criterio 29. Fecha de validación de la información publicada con el formato día/mes/año",1]
[null,null,"Criterio 30. Nota. Este criterio se cumple en caso de que sea necesario que el sujeto obligado incluya alguna aclaración relativa a la información publicada y/o explicación por la falta de información ",1]
[null,null,"Criterio 31. La información publicada se organiza mediante los formatos 44a y 44b, en los que se incluyen todos los campos especificados en los criterios sustantivos de contenido",1]
[null,null,"Criterio 32. El soporte de la información permite su reutilización",1]
{"$rows_empty":7}
[{"$nulls":3},2017,2018]
[null,null,"CS",{"$f":"IF(Aplicabilidad!G55<>\"SI\",\"NA\",SUM(E19:E41)/SUM(D19:D41))","v":"NA"},{"$f":"IF(Aplicabilidad!G55<>\"SI\",\"NA\",SUM(E49:E71)/SUM(D49:D71))","v":"NA"}]
[null,null,"CA",{"$f":"IF(Aplicabilidad!G55<>\"SI\",\"NA\",SUM(#REF!)/SUM(#REF!))","v":"NA"},{"$f":"IF(Aplicabilidad!G55<>\"SI\",\"NA\",SUM(E76:E84)/SUM(D76:D84))","v":"NA"}]
[null,null,"OBLIGACIÓN",{"$f":"IF(Aplicabilidad!G55<>\"SI\",\"NA\",D93*0.6+D94*0.4)","v":"NA"},{"$f":"IF(Aplicabilidad!G55<>\"SI\",\"NA\",E93*0.6+E94*0.4)","v":"NA"}]

{"sheet":"Art 74_XLV","index":47,"n_rows":50,"n_cols":7,"rows_kept":50,"merged":[[0,2,0,6],[4,1,4,7],[15,4,15,6]]}
[null,null,{"$f":"IF(Aplicabilidad!E2=\"\",\"\",Aplicabilidad!E2)","v":"Consejería Jurídica"}]
[]
[null,"Códigos de valoración : Cumplió totalmente = 1; Cumplió parcialmente = 0.5; No cumplió = 0; Justificado = Justificado"]
[]
[null,"Art. 74 - Fracción XLV. Instrumentos de archivos"]
[]
[null,null,"Fecha de Inicio de la Verificación:",{"$nulls":3},"Fecha de Término de la verificación"]
[null,null,{"$f":"IF(Resultados!$C$7=\"\",\"\",Resultados!$C$7)","v":"2021-07-07"},"2018-05-25",null,null,{"$f":"IF(Resultados!G7=\"\",\"\",Resultados!G7)","v":"2021-07-08"}]
[]
[null,null,"Criterios Sustantivos",null,{"$f":"IF(Aplicabilidad!G56<>\"SI\",\"NA\",(SUM(E20:E26))/(SUM(D20:D26)))","v":{"v":1,"d":"100%"}}]
[null,null,"Criterios Adjetivos",null,{"$f":"IF(Aplicabilidad!G56<>\"SI\",\"NA\",(SUM(E31:E39))/(SUM(D31:D39)))","v":{"v":1,"d":"100%"}}]
[null,null,"Obligación",null,{"$f":"IF(Aplicabilidad!G56<>\"SI\",\"NA\",E10*0.6+E11*0.4)","v":{"v":1,"d":"100.00%"}}]
[]
[]
[]
[null,null,"Criterios Sustantivos de contenido \nLTG 2018 - LTG 2020 (DOF 28/12/20) "]
[null,null,"Criterios Sustantivos de contenido LTG 2018 - LTG 2020 (DOF 28/12/20) ",{"$f":"COUNTA(F20:F39)","v":1}]
[]
[null,null,"Criterio",null,"Valoración","Tipo","Observaciones, Recomendaciones y/o Requerimientos"]
[null,null,"Criterio 1. Ejercicio",{"$f":"IF(E20=\"Justificado\",0,1)","v":1},1]
[null,null,"Criterio 2. Periodo que se informa (fecha de inicio y fecha de término con el formato día/mes/año)",{"$f":"IF(E21=\"Justificado\",0,1)","v":1},1]
[null,null,"Criterio 3 Instrumento archivístico (catálogo): Cuadro general de clasificación archivística /Catálogo de disposición documental/ Inventarios documentales/Guía de archivo documental/Índice de expedientes clasificados como reservados/ Programa Anual de Desarrollo Archivístico/ Informe Anual de cumplimiento/ Dictamen y acta de baja documental\ny transferencia secundaria /Otro - Criterio modificado DOF 28/12/2020",1,1]
[null,null,"Criterio 4 Hipervínculo a los documentos: Cuadro general de clasificación archivística, Catálogo de disposición documental, Inventarios documentales, Guía de archivo documental, Índice de expedientes clasificados como reservados, Programa Anual de Desarrollo Archivístico, Informe Anual de cumplimiento, Dictamen y acta de baja documental y transferencia secundaria u otros - Criterio modificado DOF 28/12/2020",1,1]
[null,null,"Criterio 5. Nombre completo del (la) responsable e integrantes del área ",1,1]
[null,null,"Criterio 6. Puesto del (la) responsable e integrantes del área de archivo",{"$f":"IF(E25=\"Justificado\",0,1)","v":1},1]
[null,null,"Criterio 7. Cargo del (la) responsable e integrantes del área de archivo",{"$f":"IF(E26=\"Justificado\",0,1)","v":1},1]
[]
[null,null,"Criterios Adjetivos LTG 2018 - LTG 2020 (DOF 28/12/20) "]
[]
[null,null,"Criterio",null,"Valoración","Tipo","Observaciones, Recomendaciones y/o Requerimientos"]
[null,null,"Criterio 8. Periodo de actualización: anual y semestral - Criterio modificado DOF 28/12/2020\nEl Cuadro general de clasificación archivística, el Catálogo de disposición documental, los Inventarios documentales y la Guía de archivo documental deberán publicarse durante los treinta días posteriores de que concluya el primer trimestre del ejercicio en curso.\nEl Programa Anual de Desarrollo Archivístico deberá publicarse en los primeros treinta días naturales del ejercicio en curso.\nEl Informe Anual de cumplimiento y los dictámenes y actas de baja documental y transferencia secundaria deberán publicarse a más tardar el último día del mes de enero del siguiente año.\nEl Índice de expedientes clasificados como reservados se actualizará semestralmente.",{"$f":"IF(E31=\"Justificado\",0,1)","v":1},1]
[null,null,"Criterio 9. La información deberá estar actualizada al periodo que corresponde de acuerdo con la Tabla de actualización y conservación de la información",1,1]
[null,null,"Criterio 10. Conservar en el sitio de Internet: información vigente respecto del Cuadro general de clasificación archivística, el Catálogo de disposición documental, los Inventarios documentales y la Guía de archivo\ndocumental.\nInformación del ejercicio en curso y ejercicio anterior respecto del Programa Anual de Desarrollo Archivístico y el Índice de expedientes clasificados como reservados.\nInformación del ejercicio anterior respecto del Informe Anual de  cumplimiento y de los dictámenes y actas de baja documental y transferencia secundaria.",1,1]
[null,null,"Criterio 11. Área(s) responsable(s) que genera(n), posee(n), publica(n) y/o actualiza(n) la información ",1,1]
[null,null,"Criterio 12. Fecha de actualización de la información publicada con el formato día/mes/año",1,1]
[null,null,"Criterio 13. Fecha de validación de la información publicada con el formato día/mes/año",1,1]
[null,null,"Criterio 14. Nota. Este criterio se cumple en caso de que sea necesario que el sujeto obligado incluya alguna aclaración relativa a la información publicada y/o explicación por la falta de información",1,1]
[null,null,"Criterio 15. La información publicada se organiza mediante el formato 45, en el que se incluyen todos los campos especificados en los criterios sustantivos de contenido",1,1]
[null,null,"Criterio 16. El soporte de la información permite su reutilización",1,1]
{"$rows_empty":7}
[{"$nulls":3},2017,2018]
[null,null,"CS",{"$f":"IF(Aplicabilidad!G56<>\"SI\",\"NA\",SUM(#REF!)/SUM(#REF!))","v":{"$error":"#REF!"}},{"$f":"IF(Aplicabilidad!G56<>\"SI\",\"NA\",SUM(E20:E26)/SUM(D20:D26))","v":{"v":1,"d":"100.00%"}}]
[null,null,"CA",{"$f":"IF(Aplicabilidad!G56<>\"SI\",\"NA\",SUM(#REF!)/SUM(#REF!))","v":{"$error":"#REF!"}},{"$f":"IF(Aplicabilidad!G56<>\"SI\",\"NA\",SUM(E31:E39)/SUM(D31:D39))","v":{"v":1,"d":"100.00%"}}]
[null,null,"OBLIGACIÓN",{"$f":"IF(Aplicabilidad!G56<>\"SI\",\"NA\",D48*0.6+D49*0.4)","v":{"$error":"#REF!"}},{"$f":"IF(Aplicabilidad!G56<>\"SI\",\"NA\",E48*0.6+E49*0.4)","v":{"v":1,"d":"100.00%"}}]

{"sheet":"Art 74_XLVI","index":48,"n_rows":77,"n_cols":7,"rows_kept":77,"hidden":true,"merged":[[0,2,0,6],[4,1,4,7],[14,4,14,6],[35,4,35,6]]}
[null,null,{"$f":"IF(Aplicabilidad!E2=\"\",\"\",Aplicabilidad!E2)","v":"Consejería Jurídica"}]
[]
[null,"Códigos de valoración : Cumplió totalmente = 1; Cumplió parcialmente = 0.5; No cumplió = 0; Justificado = Justificado"]
[]
[null,"Art. 74 - Fracción XLVI. Actas de las sesiones, opiniones y recomendaciones de los consejos consultivos"]
[]
[null,null,"Fecha de Inicio de la Verificación:",{"$nulls":3},"Fecha de Término de la verificación"]
[null,null,{"$f":"IF(Resultados!$C$7=\"\",\"\",Resultados!$C$7)","v":"2021-07-07"},"2018-05-25",null,null,{"$f":"IF(Resultados!G7=\"\",\"\",Resultados!G7)","v":"2021-07-08"}]
[]
[null,null,"Criterios Sustantivos",null,{"$f":"IF(Aplicabilidad!G57<>\"SI\",\"NA\",(SUM(E19:E32)+SUM(E40:E53))/(SUM(D19:D32)+SUM(D40:D53)))","v":"NA"}]
[null,null,"Criterios Adjetivos",null,{"$f":"IF(Aplicabilidad!G57<>\"SI\",\"NA\",(SUM(E58:E66))/(SUM(D58:D66)))","v":"NA"}]
[null,null,"Obligación",null,{"$f":"IF(Aplicabilidad!G57<>\"SI\",\"NA\",E10*0.6+E11*0.4)","v":"NA"}]
[]
[]
[]
[null,null,"Criterios Sustantivos de contenido \nLTG 2018 - LTG 2020 (DOF 28/12/20) ",{"$f":"COUNTA(F19:F33)","v":0}]
[]
[null,null,"Criterio",null,"Valoración","Tipo","Observaciones, Recomendaciones y/o Requerimientos"]
[null,null,"Criterio 1. Ejercicio",{"$f":"IF(E19=\"Justificado\",0,1)","v":1}]
[null,null,"Criterio 2. Periodo que se informa",{"$f":"IF(E20=\"Justificado\",0,1)","v":1}]
[null,null,"Criterio 3. Fecha expresada con el formato día/mes/año (por ej. 31/Marzo/2016)",1]
[null,null,"Criterio 4. Tipo de acta (ordinaria/extraordinaria)",1]
[null,null,"Criterio 5. Número de la sesión",1]
[null,null,"Criterio 6. Número del acta (en su caso)",1]
[null,null,"Criterio 7. Orden del día; en su caso, incluir un hipervínculo al documento",1]
[null,null,"Criterio 8. Hipervínculo a los documentos completos de las actas (versiones públicas141)",1]
[null,null,"Criterio 9. Ejercicio",1]
[null,null,"Criterio 10. Periodo que se informa (trimestre)",1]
[null,null,"Criterio 11. Tipo de documento (recomendación/opinión)",1]
[null,null,"Criterio 12. Fecha expresada con el formato (día/mes/año) en que se emitieron",1]
[null,null,"Criterio 13. Asunto o tema de las opiniones o recomendaciones (breve explicación)",{"$f":"IF(E31=\"Justificado\",0,1)","v":1}]
[null,null,"Criterio 14. Hipervínculo a los documentos completos de las opiniones y/o recomendaciones",{"$f":"IF(E32=\"Justificado\",0,1)","v":1}]
[]
[]
[]
[]
[null,null,"Criterios Sustantivos de contenido LTG 2018 - LTG 2020 (DOF 28/12/20) ",{"$f":"COUNTA(F40:F66)","v":1}]
[]
[null,null,"Criterio",null,"Valoración","Tipo","Observaciones, Recomendaciones y/o Requerimientos"]
[null,null,"Criterio 1. Ejercicio",{"$f":"IF(E40=\"Justificado\",0,1)","v":1}]
[null,null,"Criterio 2. Periodo que se informa (fecha de inicio y fecha de término con el formato día/mes/año)",{"$f":"IF(E41=\"Justificado\",0,1)","v":1}]
[null,null,"Criterio 3. Fecha expresada en que se realizaron las sesiones con el formato día/mes/año ",1]
[null,null,"Criterio 4. Tipo de acta (catálogo): ordinaria/extraordinaria",1]
[null,null,"Criterio 5. Número de la sesión",1]
[null,null,"Criterio 6. Número del acta (en su caso)",1]
[null,null,"Criterio 7. Orden del día; en su caso, incluir un hipervínculo al documento",1]
[null,null,"Criterio 8. Hipervínculo a los documentos completos de las actas (versiones públicas)",1]
[null,null,"Criterio 9. Ejercicio",1]
[null,null,"Criterio 10. Periodo que se informa (fecha de inicio y fecha de término con el formato día/mes/año) ",1]
[null,null,"Criterio 11. Tipo de documento (catálogo): recomendación/opinión",1]
[null,null,"Criterio 12. Fecha en la que se emitieron las opiniones y recomendaciones, expresada con el formato día/mes/año ",1]
[null,null,"Criterio 13. Asunto o tema de las opiniones o recomendaciones (breve explicación)",{"$f":"IF(E52=\"Justificado\",0,1)","v":1}]
[null,null,"Criterio 14. Hipervínculo a los documentos completos de las opiniones y/o recomendaciones",{"$f":"IF(E53=\"Justificado\",0,1)","v":1}]
[]
[null,null,"Criterios Adjetivos LTG 2018 - LTG 2020 (DOF 28/12/20) "]
[]
[null,null,"Criterio",null,"Valoración","Tipo","Observaciones, Recomendaciones y/o Requerimientos"]
[null,null,"Criterio 15. Periodo de actualización de la información: trimestral",{"$f":"IF(E58=\"Justificado\",0,1)","v":1}]
[null,null,"Criterio 16. Actualizar al periodo que corresponde de acuerdo con la Tabla de actualización y conservación de la información",1]
[null,null,"Criterio 17. Conservar en el sitio de Internet y a través de la Plataforma Nacional la información de acuerdo con la Tabla de actualización y conservación de la información",1]
[null,null,"Criterio 18. Área(s) responsable(s) que genera(n), posee(n), publica(n) y/o actualiza(n) la información ",1]
[null,null,"Criterio 19. Fecha de actualización de la información publicada con el formato día/mes/año",1]
[null,null,"Criterio 20. Fecha de validación de la información publicada con el formato día/mes/año",1]
[null,null,"Criterio 21. Nota. Este criterio se cumple en caso de que sea necesario que el sujeto obligado incluya alguna aclaración relativa a la información publicada y/o explicación por la falta de información ",1]
[null,null,"Criterio 22. La información publicada se organiza mediante los formatos 46a y 46b, en los que se incluyen todos los campos especificados en los criterios sustantivos de contenido",1]
[null,null,"Criterio 23. El soporte de la información permite su reutilización",1]
{"$rows_empty":7}
[{"$nulls":3},2017,2018]
[null,null,"CS",{"$f":"IF(Aplicabilidad!G57<>\"SI\",\"NA\",SUM(E19:E32)/SUM(D19:D32))","v":"NA"},{"$f":"IF(Aplicabilidad!G57<>\"SI\",\"NA\",SUM(E40:E53)/SUM(D40:D53))","v":"NA"}]
[null,null,"CA",{"$f":"IF(Aplicabilidad!G57<>\"SI\",\"NA\",SUM(#REF!)/SUM(#REF!))","v":"NA"},{"$f":"IF(Aplicabilidad!G57<>\"SI\",\"NA\",SUM(E58:E66)/SUM(D58:D66))","v":"NA"}]
[null,null,"OBLIGACIÓN",{"$f":"IF(Aplicabilidad!G57<>\"SI\",\"NA\",D75*0.6+D76*0.4)","v":"NA"},{"$f":"IF(Aplicabilidad!G57<>\"SI\",\"NA\",E75*0.6+E76*0.4)","v":"NA"}]

{"sheet":"Art 74_XLVII","index":49,"n_rows":83,"n_cols":7,"rows_kept":83,"hidden":true,"merged":[[0,2,0,6],[4,1,4,7],[14,4,14,6],[36,4,36,6]]}
[null,null,{"$f":"IF(Aplicabilidad!E2=\"\",\"\",Aplicabilidad!E2)","v":"Consejería Jurídica"}]
[]
[null,"Códigos de valoración : Cumplió totalmente = 1; Cumplió parcialmente = 0.5; No cumplió = 0; Justificado = Justificado"]
[]
[null,"Art. 74 - Fracción XLVII. Solicitudes a empresas concesionarias para la intervención de comunicaciones privadas, el acceso al registro de comunicaciones y la localización geográfica, y"]
[]
[null,null,"Fecha de Inicio de la Verificación:",{"$nulls":3},"Fecha de Término de la verificación"]
[null,null,{"$f":"IF(Resultados!$C$7=\"\",\"\",Resultados!$C$7)","v":"2021-07-07"},"2018-05-25",null,null,{"$f":"IF(Resultados!G7=\"\",\"\",Resultados!G7)","v":"2021-07-08"}]
[]
[null,null,"Criterios Sustantivos",null,{"$f":"IF(Aplicabilidad!G58<>\"SI\",\"NA\",(SUM(E19:E33)+SUM(E41:E59))/(SUM(D19:D33)+SUM(D41:D59)))","v":"NA"}]
[null,null,"Criterios Adjetivos",null,{"$f":"IF(Aplicabilidad!G58<>\"SI\",\"NA\",(SUM(E64:E72))/(SUM(D64:D72)))","v":"NA"}]
[null,null,"Obligación",null,{"$f":"IF(Aplicabilidad!G58<>\"SI\",\"NA\",E10*0.6+E11*0.4)","v":"NA"}]
[]
[]
[]
[null,null,"Criterios Sustantivos de contenido \nLTG 2018 - LTG 2020 (DOF 28/12/20) ",{"$f":"COUNTA(F19:F34)","v":0}]
[]
[null,null,"Criterio",null,"Valoración","Tipo","Observaciones, Recomendaciones y/o Requerimientos"]
[null,null,"Criterio 1. Ejercicio",{"$f":"IF(E19=\"Justificado\",0,1)","v":1}]
[null,null,"Criterio 2. Periodo que se informa",{"$f":"IF(E20=\"Justificado\",0,1)","v":1}]
[null,null,"Criterio 3. Objeto de la intervención",1]
[null,null,"Criterio 4. Fundamento legal del requerimiento: artículo, fracción, inciso",1]
[null,null,"Criterio 5. Alcance temporal",1]
[null,null,"Criterio 6. Por cada solicitud, indicar si hubo autorización judicial: (Sí/No)",1]
[null,null,"Criterio 7. Denominación de la empresa concesionaria de los servicios de comunicación vía satélite o telecomunicaciones que colaboraron en el proceso de intervención",1]
[null,null,"Criterio 8. Número total de solicitudes de intervención realizadas",1]
[null,null,"Criterio 9. Denominación de la instancia que solicita el acceso a los registros",1]
[null,null,"Criterio 10. Fecha en la que se realizó la solicitud con el formato día/mes/año (por ej. 31/Marzo/2016)",1]
[null,null,"Criterio 11. Causa que motivó la solicitud",1]
[null,null,"Criterio 12. Fundamento legal para realizar la solicitud artículo, fracción, inciso",1]
[null,null,"Criterio 13. Número total de solicitudes al registro de comunicaciones",1]
[null,null,"Criterio 14. Número total de solicitudes al registro de localización geográfica",{"$f":"IF(E32=\"Justificado\",0,1)","v":1}]
[null,null,"Criterio 15. << sujeto obligado>> no genera ni detenta la información relativa al listado de solicitudes a las empresas concesionarias de telecomunicaciones y proveedores de servicios o aplicaciones de Internet para la intervención de comunicaciones privadas, el acceso al registro de comunicaciones y la localización geográfica en tiempo real de equipos de comunicación.",{"$f":"IF(E33=\"Justificado\",0,1)","v":1}]
[]
[]
[]
[]
[null,null,"Criterios Sustantivos de contenido LTG 2018 - LTG 2020 (DOF 28/12/20) ",{"$f":"COUNTA(F41:F72)","v":1}]
[]
[null,null,"Criterio",null,"Valoración","Tipo","Observaciones, Recomendaciones y/o Requerimientos"]
[null,null,"Criterio 1. Ejercicio",{"$f":"IF(E41=\"Justificado\",0,1)","v":1}]
[null,null,"Criterio 2. Periodo que se informa (fecha de inicio y fecha de término con el formato día/mes/año)",{"$f":"IF(E42=\"Justificado\",0,1)","v":1}]
[null,null,"Criterio 3. Objeto de la intervención",1]
[null,null,"Criterio 4. Fundamento legal del requerimiento: artículo, fracción, inciso",1]
[null,null,"Criterio 5. Alcance temporal",1]
[null,null,"Criterio 6. Por cada solicitud, indicar si hubo autorización judicial (catálogo): Sí/No",1]
[null,null,"Criterio 7. Denominación de la empresa concesionaria de los servicios de comunicación vía satélite o telecomunicaciones que colaboraron en el proceso de intervención",1]
[null,null,"Criterio 8. Número total de solicitudes de intervención realizadas",1]
[null,null,"Criterio 9. Ejercicio",1]
[null,null,"Criterio 10. Periodo que se informa (fecha de inicio y fecha de término con el formato día/mes/año)",1]
[null,null,"Criterio 11. Denominación de la instancia que solicita el acceso a los registros",1]
[null,null,"Criterio 12. Fecha en la que se realizó la solicitud con el formato día/mes/año ",1]
[null,null,"Criterio 13. Causa que motivó la solicitud",1]
[null,null,"Criterio 14. Fundamento legal para realizar la solicitud artículo, fracción, inciso",1]
[null,null,"Criterio 15. Número total de solicitudes al registro de comunicaciones",1]
[null,null,"Criterio 16. Número total de solicitudes al registro de localización geográfica",1]
[null,null,"Criterio 17. Ejercicio",1]
[null,null,"Criterio 18. Periodo que se informa (fecha de inicio y fecha de término con el formato día/mes/año)",{"$f":"IF(E58=\"Justificado\",0,1)","v":1}]
[null,null,"Criterio 19. Mensaje << sujeto obligado>> no genera ni detenta la información relativa al listado de solicitudes a las empresas concesionarias de telecomunicaciones y proveedores de servicios o aplicaciones de Internet para la intervención de comunicaciones privadas, el acceso al registro de comunicaciones y la localización geográfica en tiempo real de equipos de comunicación.",{"$f":"IF(E59=\"Justificado\",0,1)","v":1}]
[]
[null,null,"Criterios Adjetivos LTG 2018 - LTG 2020 (DOF 28/12/20) "]
[]
[null,null,"Criterio",null,"Valoración","Tipo","Observaciones, Recomendaciones y/o Requerimientos"]
[null,null,"Criterio 20. Periodo de actualización de la información: trimestral",{"$f":"IF(E64=\"Justificado\",0,1)","v":1}]
[null,null,"Criterio 21. La información deberá estar actualizada al periodo que corresponde de acuerdo con la Tabla de actualización y conservación de la información",1]
[null,null,"Criterio 22. Conservar en el sitio de Internet y a través de la Plataforma Nacional la información de acuerdo con la Tabla de actualización y conservación de la información",1]
[null,null,"Criterio 23. Área(s) responsable(s) que genera(n), posee(n), publica(n) y/o actualiza(n) la información ",1]
[null,null,"Criterio 24. Fecha de actualización de la información publicada con el formato día/mes/año",1]
[null,null,"Criterio 25. Fecha de validación de la información publicada con el formato día/mes/año",1]
[null,null,"Criterio 26. Nota. Este criterio se cumple en caso de que sea necesario que el sujeto obligado incluya alguna aclaración relativa a la información publicada y/o explicación por la falta de información",1]
[null,null,"Criterio 27. La información publicada se organiza mediante los formatos 47a, 47b y 47c en los que se incluyen todos los campos especificados en los criterios sustantivos de contenido",1]
[null,null,"Criterio 28. El soporte de la información permite su reutilización",1]
{"$rows_empty":7}
[{"$nulls":3},2017,2018]
[null,null,"CS",{"$f":"IF(Aplicabilidad!G58<>\"SI\",\"NA\",SUM(E19:E33)/SUM(D19:D33))","v":"NA"},{"$f":"IF(Aplicabilidad!G58<>\"SI\",\"NA\",SUM(E41:E59)/SUM(D41:D59))","v":"NA"}]
[null,null,"CA",{"$f":"IF(Aplicabilidad!G58<>\"SI\",\"NA\",SUM(#REF!)/SUM(#REF!))","v":"NA"},{"$f":"IF(Aplicabilidad!G58<>\"SI\",\"NA\",SUM(E64:E72)/SUM(D64:D72))","v":"NA"}]
[null,null,"OBLIGACIÓN",{"$f":"IF(Aplicabilidad!G58<>\"SI\",\"NA\",D81*0.6+D82*0.4)","v":"NA"},{"$f":"IF(Aplicabilidad!G58<>\"SI\",\"NA\",E81*0.6+E82*0.4)","v":"NA"}]

{"sheet":"Art 74_XLVIII","index":50,"n_rows":57,"n_cols":7,"rows_kept":57,"merged":[[0,2,0,6],[4,1,4,7],[14,4,14,6]]}
[null,null,{"$f":"IF(Aplicabilidad!E2=\"\",\"\",Aplicabilidad!E2)","v":"Consejería Jurídica"}]
[]
[null,"Códigos de valoración : Cumplió totalmente = 1; Cumplió parcialmente = 0.5; No cumplió = 0; Justificado = Justificado"]
[]
[null,"Art. 74 - Fracción XLVIII. Otra información útil o relevante"]
[]
[null,null,"Fecha de Inicio de la Verificación:",{"$nulls":3},"Fecha de Término de la verificación"]
[null,null,{"$f":"IF(Resultados!$C$7=\"\",\"\",Resultados!$C$7)","v":"2021-07-07"},"2018-05-25",null,null,{"$f":"IF(Resultados!G7=\"\",\"\",Resultados!G7)","v":"2021-07-08"}]
[]
[null,null,"Criterios Sustantivos",null,{"$f":"IF(Aplicabilidad!G59<>\"SI\",\"NA\",(+SUM(E19:E33))/(+SUM(D19:D33)))","v":{"v":1,"d":"100%"}}]
[null,null,"Criterios Adjetivos",null,{"$f":"IF(Aplicabilidad!G59<>\"SI\",\"NA\",(+SUM(E38:E46))/(+SUM(D38:D46)))","v":{"v":1,"d":"100%"}}]
[null,null,"Obligación",null,{"$f":"IF(Aplicabilidad!G59<>\"SI\",\"NA\",E10*0.6+E11*0.4)","v":{"v":1,"d":"100.00%"}}]
[]
[]
[]
[null,null,"Criterios Sustantivos de contenido \nLTG 2018 - LTG 2020 (DOF 28/12/20) ",{"$f":"COUNTA(F19:F46)","v":1}]
[]
[null,null,"Criterio",null,"Valoración","Tipo","Observaciones, Recomendaciones y/o Requerimientos"]
[null,null,"Criterio 1. Ejercicio",{"$f":"IF(E19=\"Justificado\",0,1)","v":1},1]
[null,null,"Criterio 2. Periodo que se informa (fecha de inicio y fecha de término con el formato día/mes/año)",{"$f":"IF(E20=\"Justificado\",0,1)","v":1},1]
[null,null,"Criterio 3. Descripción breve, clara y precisa que dé cuenta del contenido de la información",1,1]
[null,null,"Criterio 4. Fecha de elaboración con el formato día/mes/año ",1,1]
[null,null,"Criterio 5. Hipervínculo a la información, documentos o datos respectivos, y a la determinada por el Organismo garante en el catálogo de interés público.\nCriterio modificado DOF 28/12/2020",1,1]
[null,null,"Criterio 6. Ejercicio",1,1]
[null,null,"Criterio 7. Periodo que se informa (fecha de inicio y fecha de término con el formato día/mes/año)",1,1]
[null,null,"Criterio 8. Temática de las preguntas frecuentes, por ejemplo: ejercicio de recursos públicos; regulatorio, actos de gobierno, relación con la sociedad, organización interna, programático, informes, programas, atención a la ciudadanía; evaluaciones, estudios",1,1]
[null,null,"Criterio 9. Planteamiento de las preguntas frecuentes",1,1]
[null,null,"Criterio 10. Respuesta a cada una de las preguntas frecuentes planteadas",1,1]
[null,null,"Criterio 11. Hipervínculo al Informe estadístico (en su caso)",0,"Justificado"]
[null,null,"Criterio 12. Número total de preguntas realizadas por las personas al sujeto obligado",1,1]
[null,null,"Criterio 13. Ejercicio",1,1]
[null,null,"Criterio 14. Periodo que se informa (fecha de inicio y fecha de término con el formato día/mes/año)",{"$f":"IF(E32=\"Justificado\",0,1)","v":1},1]
[null,null,"Criterio 15. Hipervínculo la información publicada de manera proactiva (en su caso)",{"$f":"IF(E33=\"Justificado\",0,1)","v":0},"Justificado"]
[]
[null,null,"Criterios Adjetivos LTG 2018 - LTG 2020 (DOF 28/12/20) "]
[]
[null,null,"Criterio",null,"Valoración","Tipo","Observaciones, Recomendaciones y/o Requerimientos"]
[null,null,"Criterio 16. Periodo de actualización de la información: trimestral",{"$f":"IF(E38=\"Justificado\",0,1)","v":1},1]
[null,null,"Criterio 17. La información deberá estar actualizada al periodo que corresponde de acuerdo con la Tabla de actualización y conservación de la información",1,1]
[null,null,"Criterio 18. Conservar en el sitio de Internet y a través de la Plataforma Nacional la Información vigente",1,1]
[null,null,"Criterio 19. Área(s) responsable(s) que genera(n), posee(n), publica(n) y/o actualiza(n) la información ",1,1]
[null,null,"Criterio 20. Fecha de actualización de la información publicada con el formato día/mes/año",1,1]
[null,null,"Criterio 21. Fecha de validación de la información publicada con el formato día/mes/año",1,1]
[null,null,"Criterio 22. Nota. Este criterio se cumple en caso de que sea necesario que el sujeto obligado incluya alguna aclaración relativa a la información publicada y/o explicación por la falta de información",1,1]
[null,null,"Criterio 23. La información publicada se organiza mediante los formatos 48a, 48b y 48c, en los que se incluyen todos los campos especificados en los criterios sustantivos de contenido",1,1]
[null,null,"Criterio 24. El soporte de la información permite su reutilización",1,1]
{"$rows_empty":7}
[{"$nulls":3},2017,2018]
[null,null,"CS","NA",{"$f":"IF(Aplicabilidad!G59<>\"SI\",\"NA\",SUM(E19:E33)/SUM(D19:D33))","v":{"v":1,"d":"100.00%"}}]
[null,null,"CA","NA",{"$f":"IF(Aplicabilidad!G59<>\"SI\",\"NA\",SUM(E38:E46)/SUM(D38:D46))","v":{"v":1,"d":"100.00%"}}]
[null,null,"OBLIGACIÓN","NA",{"$f":"IF(Aplicabilidad!G59<>\"SI\",\"NA\",E55*0.6+E56*0.4)","v":{"v":1,"d":"100.00%"}}]

{"sheet":"Art 74_Ult.P","index":51,"n_rows":49,"n_cols":7,"rows_kept":49,"merged":[[0,2,0,6],[4,1,4,7],[14,4,14,6],[17,4,17,6]]}
[null,null,{"$f":"IF(Aplicabilidad!E2=\"\",\"\",Aplicabilidad!E2)","v":"Consejería Jurídica"}]
[]
[null,"Códigos de valoración : Cumplió totalmente = 1; Cumplió parcialmente = 0.5; No cumplió = 0; Justificado = Justificado"]
[]
[null,"Art. 74 - Último Párrafo. Aplicabilidad y conservación"]
[]
[null,null,"Fecha de Inicio de la Verificación:",{"$nulls":3},"Fecha de Término de la verificación"]
[null,null,{"$f":"IF(Resultados!$C$7=\"\",\"\",Resultados!$C$7)","v":"2021-07-07"},"2018-05-25",null,null,{"$f":"IF(Resultados!G7=\"\",\"\",Resultados!G7)","v":"2021-07-08"}]
[]
[null,null,"Criterios Sustantivos",null,{"$f":"IF(Aplicabilidad!G60<>\"SI\",\"NA\",(SUM(E22:E25))/(SUM(D22:D25)))","v":{"v":1,"d":"100%"}}]
[null,null,"Criterios Adjetivos",null,{"$f":"IF(Aplicabilidad!G60<>\"SI\",\"NA\",(SUM(E30:E38))/(SUM(D30:D38)))","v":{"v":1,"d":"100%"}}]
[null,null,"Obligación",null,{"$f":"IF(Aplicabilidad!G60<>\"SI\",\"NA\",E10*0.6+E11*0.4)","v":{"v":1,"d":"100.00%"}}]
[]
[]
[]
[null,null,"Criterios Sustantivos de contenido \nLTG 2018 - LTG 2020 (DOF 28/12/20) "]
[]
[]
[null,null,"Criterios Sustantivos de contenido \nLTG 2018 - LTG 2020 (DOF 28/12/20) ",{"$f":"COUNTA(F22:F38)","v":1}]
[]
[null,null,"Criterio",null,"Valoración","Tipo","Observaciones, Recomendaciones y/o Requerimientos"]
[null,null,"Criterio 1. Ejercicio",{"$f":"IF(E22=\"Justificado\",0,1)","v":1},1]
[null,null,"Criterio 2. Periodo que se informa (fecha de inicio y fecha de término con el formato día/mes/año)",{"$f":"IF(E23=\"Justificado\",0,1)","v":1},1]
[null,null,"Criterio 3. Hipervínculo a la Tabla de Aplicabilidad de las Obligaciones de Transparencia Comunes",{"$f":"IF(E24=\"Justificado\",0,1)","v":1},1]
[null,null,"Criterio 4. Hipervínculo a la Tabla de actualización y conservación de la información",{"$f":"IF(E25=\"Justificado\",0,1)","v":1},1]
[]
[null,null,"Criterios Adjetivos LTG 2018 - LTG 2020 (DOF 28/12/20) "]
[]
[null,null,"Criterio",null,"Valoración","Tipo","Observaciones, Recomendaciones y/o Requerimientos"]
[null,null,"Criterio 5. Periodo de actualización de la información: anual. En su caso, 15 días hábiles después de alguna modificación. - Párrafo Modificado DOF 28/12/2020",{"$f":"IF(E30=\"Justificado\",0,1)","v":1},1]
[null,null,"Criterio 6. La información publicada deberá estar actualizada al periodo que corresponde de acuerdo con la Tabla de actualización y conservación de la información",1,1]
[null,null,"Criterio 7. Conservar en el sitio de Internet y a través de la Plataforma Nacional la información  vigente y la generada en el ejercicio en curso",1,1]
[null,null,"Criterio 8. Área(s) responsable(s) que genera(n), posee(n), publica(n) y/o actualiza(n) la información ",1,1]
[null,null,"Criterio 9. Fecha de actualización de la información publicada con el formato día/mes/año",1,1]
[null,null,"Criterio 10. Fecha de validación de la información publicada con el formato día/mes/año",1,1]
[null,null,"Criterio 11. Nota. Este criterio se cumple en caso de que sea necesario que el sujeto obligado incluya alguna aclaración relativa a la información publicada y/o explicación por la falta de información ",1,1]
[null,null,"Criterio 12. La información publicada se organiza mediante el formato 70_00, en el que se incluyen todos los campos especificados en los criterios sustantivos de contenido",1,1]
[null,null,"Criterio 13. El soporte de la información permite su reutilización",1,1]
{"$rows_empty":7}
[{"$nulls":3},2017,2018]
[null,null,"CS",{"$f":"IF(Aplicabilidad!G60<>\"SI\",\"NA\",SUM(#REF!)/SUM(#REF!))","v":{"$error":"#REF!"}},{"$f":"IF(Aplicabilidad!G60<>\"SI\",\"NA\",SUM(E22:E25)/SUM(D22:D25))","v":{"v":1,"d":"100.00%"}}]
[null,null,"CA",{"$f":"IF(Aplicabilidad!G60<>\"SI\",\"NA\",SUM(#REF!)/SUM(#REF!))","v":{"$error":"#REF!"}},{"$f":"IF(Aplicabilidad!G60<>\"SI\",\"NA\",SUM(E30:E38)/SUM(D30:D38))","v":{"v":1,"d":"100.00%"}}]
[null,null,"OBLIGACIÓN",{"$f":"IF(Aplicabilidad!G60<>\"SI\",\"NA\",D47*0.6+D48*0.4)","v":{"$error":"#REF!"}},{"$f":"IF(Aplicabilidad!G60<>\"SI\",\"NA\",E47*0.6+E48*0.4)","v":{"v":1,"d":"100.00%"}}]

{"sheet":"Art 75_I","index":52,"n_rows":85,"n_cols":7,"rows_kept":85,"hidden":true,"merged":[[0,2,0,6],[4,1,4,7],[14,4,14,6],[42,4,42,6]]}
[null,null,{"$f":"IF(Aplicabilidad!E2=\"\",\"\",Aplicabilidad!E2)","v":"Consejería Jurídica"}]
[]
[null,"Códigos de valoración : Cumplió totalmente = 1; Cumplió parcialmente = 0.5; No cumplió = 0; Justificado = Justificado"]
[]
[null,"Art. 75 - Fracción I. Plan de Desarrollo"]
[]
[null,null,"Fecha de Inicio de la Verificación:",{"$nulls":3},"Fecha de Término de la verificación"]
[null,null,{"$f":"IF(Resultados!$C$7=\"\",\"\",Resultados!$C$7)","v":"2021-07-07"},"2018-05-25",null,null,{"$f":"IF(Resultados!G7=\"\",\"\",Resultados!G7)","v":"2021-07-08"}]
[]
[null,null,"Criterios Sustantivos",null,{"$f":"IF(Aplicabilidad!G61<>\"SI\",\"NA\",(SUM(E19:E28)+SUM(E47:E61))/(SUM(D19:D28)+SUM(D47:D61)))","v":"NA"}]
[null,null,"Criterios Adjetivos",null,{"$f":"IF(Aplicabilidad!G61<>\"SI\",\"NA\",(SUM(E33:E40)+SUM(E66:E74))/(SUM(D33:D40)+SUM(D66:D74)))","v":"NA"}]
[null,null,"Obligación",null,{"$f":"IF(Aplicabilidad!G61<>\"SI\",\"NA\",E10*0.6+E11*0.4)","v":"NA"}]
[]
[]
[]
[null,null,"Criterios Sustantivos de contenido \nLTG 2018 - LTG 2020 (DOF 28/12/20) ",{"$f":"COUNTA(F19:F40)","v":1}]
[]
[null,null,"Criterio",null,"Valoración","Tipo","Observaciones, Recomendaciones y/o Requerimientos"]
[null,null,"Criterio 1. Periodo que se informa",{"$f":"IF(E19=\"Justificado\",0,1)","v":1}]
[null,null,"Criterio 2. Denominación del Plan de Desarrollo",{"$f":"IF(E20=\"Justificado\",0,1)","v":1}]
[null,null,"Criterio 3. Ámbito de aplicación: Nacional/Estatal/Municipal",1]
[null,null,"Criterio 4. Fecha de publicación en el Diario Oficial de la Federación, periódico o gaceta oficial, con el formato día/mes/año (por ej. 31/Marzo/2016)",1]
[null,null,"Criterio 5. Descripción breve de los objetivos del Plan correspondiente",1]
[null,null,"Criterio 6. Descripción breve de las metas planeadas en la administración",1]
[null,null,"Criterio 7. Descripción breve de las estrategias transversales para la implementación del Plan de Desarrollo",1]
[null,null,"Criterio 8. Descripción de la metodología utilizada para la constitución del Plan (consultas, foros, sectores sociales para la elaboración del Plan)",1]
[null,null,"Criterio 9. Fecha de última modificación, en el Diario Oficial de la Federación, periódico o gaceta oficial, en su caso, expresada con el formato día/mes/año (por ej. 31/Marzo/2016)",{"$f":"IF(E27=\"Justificado\",0,1)","v":1}]
[null,null,"Criterio 10. Hipervínculo al Programa correspondiente, publicado en el Diario Oficial de la Federación, periódico o gaceta oficial que corresponda completo y vigente",{"$f":"IF(E28=\"Justificado\",0,1)","v":1}]
[]
[null,null,"Criterios Adjetivos LTG 2015-2017"]
[]
[null,null,"Criterio",null,"Valoración","Tipo","Observaciones, Recomendaciones y/o Requerimientos"]
[null,null,"Criterio 11. Periodo de actualización de la información: sexenal para el Poder Ejecutivo Federal. Las entidades federativas y el Gobierno de la Ciudad de México: cuando se decrete el Plan respectivo cada seis años; en caso de que el Congreso de la Unión realice observaciones para su ejecución, revisión o adecuación, se actualizará en marzo de cada año. Trianual para los municipios (Ayuntamientos), los cuales actualizarán el Plan Municipal de Desarrollo cada tres o cuatro años, dependiendo de la legislación local que corresponda",{"$f":"IF(E33=\"Justificado\",0,1)","v":1}]
[null,null,"Criterio 12. La información publicada deberá estar actualizada al periodo que corresponde de acuerdo con la Tabla de actualización y conservación de la información",1]
[null,null,"Criterio 13. Conservar en el sitio de Internet y a través de la Plataforma Nacional la información de acuerdo con la Tabla de actualización y conservación de la información",1]
[null,null,"Criterio 14. Área(s) o unidad(es) administrativa(s) que genera(n) o posee(n) la información respectiva y son responsables de publicarla y actualizarla",1]
[null,null,"Criterio 15. Fecha de actualización de la información publicada con el formato día/mes/año (por ej. 31/Marzo/2016)",1]
[null,null,"Criterio 16. Fecha de validación de la información publicada con el formato día/mes/año (por ej. 31/Marzo/2016)",1]
[null,null,"Criterio 17. La información publicada se organiza mediante el formato 1a, en el que se incluyen todos los campos especificados en los criterios sustantivos de contenido",1]
[null,null,"Criterio 18. El soporte de la información permite su reutilización",1]
[]
[]
[]
[null,null,"Criterios Sustantivos de contenido LTG 2018 - LTG 2020 (DOF 28/12/20) ",{"$f":"COUNTA(F47:F74)","v":1}]
[]
[null,null,"Criterio",null,"Valoración","Tipo","Observaciones, Recomendaciones y/o Requerimientos"]
[null,null,"Criterio 1. Ejercicio",{"$f":"IF(E47=\"Justificado\",0,1)","v":1}]
[null,null,"Criterio 2. Periodo que se informa (fecha de inicio y fecha de término con el formato día/mes/año)",{"$f":"IF(E48=\"Justificado\",0,1)","v":1}]
[null,null,"Criterio 3. Mensaje “La publicación y actualización de la información está a cargo de <<incluir la denominación del sujeto obligado>>.”",1]
[null,null,"Criterio 4. Hipervínculo que dirija a la ruta específica hacia la información del sujeto obligado que hayan referido",1]
[null,null,"Criterio 5. Ejercicio",1]
[null,null,"Criterio 6. Periodo que se informa (fecha de inicio y fecha de término con el formato día/mes/año)",1]
[null,null,"Criterio 7. Denominación del Plan de Desarrollo",1]
[null,null,"Criterio 8. Ámbito de aplicación: Nacional/Estatal/Municipal",1]
[null,null,"Criterio 9. Fecha de publicación en el Diario Oficial de la Federación, periódico o gaceta oficial, con el formato día/mes/año ",1]
[null,null,"Criterio 10. Descripción breve de los objetivos del Plan correspondiente",1]
[null,null,"Criterio 11. Descripción breve de las metas planeadas en la administración",1]
[null,null,"Criterio 12. Descripción breve de las estrategias transversales para la implementación del Plan de Desarrollo",1]
[null,null,"Criterio 13. Descripción de la metodología utilizada para la constitución del Plan (consultas, foros, sectores sociales para la elaboración del Plan)",1]
[null,null,"Criterio 14. Fecha de última modificación, en el Diario Oficial de la Federación, periódico o gaceta oficial, en su caso, expresada con el formato día/mes/año ",{"$f":"IF(E60=\"Justificado\",0,1)","v":1}]
[null,null,"Criterio 15. Hipervínculo al Programa correspondiente, publicado en el Diario Oficial de la Federación, periódico o gaceta oficial que corresponda completo y vigente",{"$f":"IF(E61=\"Justificado\",0,1)","v":1}]
[]
[null,null,"Criterios Adjetivos LTG 2018 - LTG 2020 (DOF 28/12/20) "]
[]
[null,null,"Criterio",null,"Valoración","Tipo","Observaciones, Recomendaciones y/o Requerimientos"]
[null,null,"Criterio 16. Periodo de actualización de la información: sexenal para el Poder Ejecutivo Federal. Las entidades federativas y el Gobierno de la Ciudad de México: cuando se decrete el Plan respectivo cada seis años; en caso de que el Congreso de la Unión realice observaciones para su ejecución, revisión o adecuación, se actualizará en marzo de cada año. Trianual para los municipios (Ayuntamientos), los cuales actualizarán el Plan Municipal de Desarrollo cada tres o cuatro años, dependiendo de la legislación local que corresponda",{"$f":"IF(E66=\"Justificado\",0,1)","v":1}]
[null,null,"Criterio 17. La información publicada deberá estar actualizada al periodo que corresponde de acuerdo con la Tabla de actualización y conservación de la información",1]
[null,null,"Criterio 18. Conservar en el sitio de Internet y a través de la Plataforma Nacional la información de acuerdo con la Tabla de actualización y conservación de la información",1]
[null,null,"Criterio 19. Área(s) responsable(s) que genera(n) posee(n), publica(n) y/o actualiza(n)la información  ",1]
[null,null,"Criterio 20. Fecha de actualización de la información publicada con el formato día/mes/año  ",1]
[null,null,"Criterio 21. Fecha de validación de la información publicada con el formato día/mes/año ",1]
[null,null,"Criterio 22. Nota. Este criterio se cumple en caso de que sea necesario que el sujeto obligado incluya alguna aclaración relativa a la información publicada y/o explicación por la falta de información ",1]
[null,null,"Criterio 23. La información publicada se organiza mediante el formato 1a, en el que se incluyen todos los campos especificados en los criterios sustantivos de contenido",1]
[null,null,"Criterio 24. El soporte de la información permite su reutilización",1]
{"$rows_empty":7}
[{"$nulls":3},2017,2018]
[null,null,"CS",{"$f":"IF(Aplicabilidad!G61<>\"SI\",\"NA\",SUM(E19:E28)/SUM(D19:D28))","v":"NA"},{"$f":"IF(Aplicabilidad!G61<>\"SI\",\"NA\",SUM(E47:E61)/SUM(D47:D61))","v":"NA"}]
[null,null,"CA",{"$f":"IF(Aplicabilidad!G61<>\"SI\",\"NA\",SUM(E33:E40)/SUM(D33:D40))","v":"NA"},{"$f":"IF(Aplicabilidad!G61<>\"SI\",\"NA\",SUM(E66:E74)/SUM(D66:D74))","v":"NA"}]
[null,null,"OBLIGACIÓN",{"$f":"IF(Aplicabilidad!G61<>\"SI\",\"NA\",D83*0.6+D84*0.4)","v":"NA"},{"$f":"IF(Aplicabilidad!G61<>\"SI\",\"NA\",E83*0.6+E84*0.4)","v":"NA"}]

{"sheet":"Art 75_II","index":53,"n_rows":89,"n_cols":7,"rows_kept":89,"hidden":true,"merged":[[0,2,0,6],[4,1,4,7],[14,4,14,6],[47,4,47,6]]}
[null,null,{"$f":"IF(Aplicabilidad!E2=\"\",\"\",Aplicabilidad!E2)","v":"Consejería Jurídica"}]
[]
[null,"Códigos de valoración : Cumplió totalmente = 1; Cumplió parcialmente = 0.5; No cumplió = 0; Justificado = Justificado"]
[]
[null,"Art. 75 - Fracción II. Presupuesto de egresos"]
[]
[null,null,"Fecha de Inicio de la Verificación:",{"$nulls":3},"Fecha de Término de la verificación"]
[null,null,{"$f":"IF(Resultados!$C$7=\"\",\"\",Resultados!$C$7)","v":"2021-07-07"},"2018-05-25",null,null,{"$f":"IF(Resultados!G7=\"\",\"\",Resultados!G7)","v":"2021-07-08"}]
[]
[null,null,"Criterios Sustantivos",null,{"$f":"IF(Aplicabilidad!G62<>\"SI\",\"NA\",(SUM(E19:E33)+SUM(E52:E65))/(SUM(D19:D33)+SUM(D52:D65)))","v":"NA"}]
[null,null,"Criterios Adjetivos",null,{"$f":"IF(Aplicabilidad!G62<>\"SI\",\"NA\",(SUM(E38:E45)+SUM(E70:E78))/(SUM(D38:D45)+SUM(D70:D78)))","v":"NA"}]
[null,null,"Obligación",null,{"$f":"IF(Aplicabilidad!G62<>\"SI\",\"NA\",E10*0.6+E11*0.4)","v":"NA"}]
[]
[]
[]
[null,null,"Criterios Sustantivos de contenido \nLTG 2018 - LTG 2020 (DOF 28/12/20) ",{"$f":"COUNTA(F19:F45)","v":1}]
[]
[null,null,"Criterio",null,"Valoración","Tipo","Observaciones, Recomendaciones y/o Requerimientos"]
[null,null,"Criterio 1. Leyenda: “La publicación y actualización de la información está a cargo de <<sujeto obligado>>.”",{"$f":"IF(E19=\"Justificado\",0,1)","v":1}]
[null,null,"Criterio 2. Hipervínculo al portal de transparencia del sujeto obligado que hayan referido",{"$f":"IF(E20=\"Justificado\",0,1)","v":1}]
[null,null,"Criterio 3. Ejercicio",1]
[null,null,"Criterio 4. Presupuesto anual asignado (gasto programable autorizado) al sujeto obligado",1]
[null,null,"Criterio 5. Presupuesto por capítulo de gasto (con base en el Clasificador por Objeto de Gasto que le corresponda al sujeto obligado)",1]
[null,null,"Criterio 6. Criterios de gasto que deben observarse en la administración de los recursos públicos",1]
[null,null,"Criterio 7. Hipervínculo al Presupuesto de Egresos de la Federación",1]
[null,null,"Criterio 8. Hipervínculo al Decreto de Presupuesto de Egresos de la Entidad Federativa",1]
[null,null,"Criterio 9. Hipervínculo a la “Versión Ciudadana” del Presupuesto de Egresos de la Federación, que elabora la Secretaría de Hacienda y Crédito Público",1]
[null,null,"Criterio 10. Denominación del sujeto obligado (catálogo)",1]
[null,null,"Criterio 11. Monto total entregado al sujeto obligado",1]
[null,null,"Criterio 12. Monto asignado a gasto corriente",1]
[null,null,"Criterio 13. Monto asignado a gasto de inversión",1]
[null,null,"Criterio 14. Monto asignado a pagar deuda pública",{"$f":"IF(E32=\"Justificado\",0,1)","v":1}]
[null,null,"Criterio 15. Hipervínculo a la(s) fórmula(s) de distribución del presupuesto usadas en el Presupuesto de Egresos respectivo, (en su caso)",{"$f":"IF(E33=\"Justificado\",0,1)","v":1}]
[]
[null,null,"Criterios Adjetivos LTG 2015-2017"]
[]
[null,null,"Criterio",null,"Valoración","Tipo","Observaciones, Recomendaciones y/o Requerimientos"]
[null,null,"Criterio 16. Periodo de actualización de la información: anual",{"$f":"IF(E38=\"Justificado\",0,1)","v":1}]
[null,null,"Criterio 17. La información deberá estar actualizada al periodo que corresponde de acuerdo con la Tabla de actualización y conservación de la información",1]
[null,null,"Criterio 18. Conservar en el sitio de Internet y a través de la Plataforma Nacional la información de acuerdo con la Tabla de actualización y conservación de la información",1]
[null,null,"Criterio 19. Área(s) o unidad(es) administrativa(s) que genera(n) o posee(n) la información respectiva y son responsables de publicarla y actualizarla",1]
[null,null,"Criterio 20. Fecha de actualización de la información publicada con el formato día/mes/año (por ej. 31/Marzo/2016)",1]
[null,null,"Criterio 21. Fecha de validación de la información publicada con el formato día/mes/año (por ej. 31/Marzo/2016)",1]
[null,null,"Criterio 22. La información publicada se organiza mediante el formato 1b, en el que se incluyen todos los campos especificados en los criterios sustantivos de contenido",1]
[null,null,"Criterio 23. El soporte de la información permite su reutilización",1]
[]
[]
[]
[null,null,"Criterios Sustantivos de contenido LTG 2018 - LTG 2020 (DOF 28/12/20) ",{"$f":"COUNTA(F52:F78)","v":1}]
[]
[null,null,"Criterio",null,"Valoración","Tipo","Observaciones, Recomendaciones y/o Requerimientos"]
[null,null,"Criterio 1. Ejercicio",{"$f":"IF(E52=\"Justificado\",0,1)","v":1}]
[null,null,"Criterio 2. Periodo que se informa (fecha de inicio y fecha de término con el formato día/mes/año)",{"$f":"IF(E53=\"Justificado\",0,1)","v":1}]
[null,null,"Criterio 3. Presupuesto anual asignado (gasto programable autorizado) al sujeto obligado",1]
[null,null,"Criterio 4. Hipervínculo al documento con los criterios de gasto que deben observarse en la administración de los recursos públicos",1]
[null,null,"Criterio 5. Hipervínculo al Presupuesto de Egresos de la Federación o de la Entidad Federativa que corresponda",1]
[null,null,"Criterio 6. Hipervínculo a la “Versión Ciudadana” del Presupuesto de Egresos de la Federación, que elabora la Secretaría de Hacienda y Crédito Público",1]
[null,null,"Criterio 7. Ejercicio",1]
[null,null,"Criterio 8. Periodo que se informa fecha de inicio y fecha de término con el formato día/mes/año",1]
[null,null,"Criterio 9. Denominación del sujeto obligado ",1]
[null,null,"Criterio 10. Monto total entregado al sujeto obligado",1]
[null,null,"Criterio 11. Monto asignado a gasto corriente ",1]
[null,null,"Criterio 12. Monto asignado a gasto de inversión",1]
[null,null,"Criterio 13. Monto asignado a pagar deuda pública",{"$f":"IF(E64=\"Justificado\",0,1)","v":1}]
[null,null,"Criterio 14. Hipervínculo a la(s) fórmula(s) de distribución del presupuesto usadas en el Presupuesto de Egresos respectivo, (en su caso)",{"$f":"IF(E65=\"Justificado\",0,1)","v":1}]
[]
[null,null,"Criterios Adjetivos LTG 2018 - LTG 2020 (DOF 28/12/20) "]
[]
[null,null,"Criterio",null,"Valoración","Tipo","Observaciones, Recomendaciones y/o Requerimientos"]
[null,null,"Criterio 15. Periodo de actualización de la información: anual",{"$f":"IF(E70=\"Justificado\",0,1)","v":1}]
[null,null,"Criterio 16. La información deberá estar actualizada al periodo que corresponde de acuerdo con la Tabla de actualización y conservación de la información",1]
[null,null,"Criterio 17. Conservar en el sitio de Internet y a través de la Plataforma Nacional la información de acuerdo con la Tabla de actualización y conservación de la información",1]
[null,null,"Criterio 18. Área(s) responsable(s) que genera(n) posee(n), publica(n) y/o actualiza(n)la información ",1]
[null,null,"Criterio 19. Fecha de actualización de la información publicada con el formato día/mes/año  ",1]
[null,null,"Criterio 20. Fecha de validación de la información publicada con el formato día/mes/año  ",1]
[null,null,"Criterio 21. Nota. Este criterio se cumple en caso de que sea necesario que el sujeto obligado incluya alguna aclaración relativa a la información publicada y/o explicación por la falta de información ",1]
[null,null,"Criterio 22. La información publicada se organiza mediante el formato 1b y 2b en el que se incluyen todos los campos especificados en los criterios sustantivos de contenido",1]
[null,null,"Criterio 23. El soporte de la información permite su reutilización",1]
{"$rows_empty":7}
[{"$nulls":3},2017,2018]
[null,null,"CS",{"$f":"IF(Aplicabilidad!G62<>\"SI\",\"NA\",SUM(E19:E33)/SUM(D19:D33))","v":"NA"},{"$f":"IF(Aplicabilidad!G62<>\"SI\",\"NA\",SUM(E52:E65)/SUM(D52:D65))","v":"NA"}]
[null,null,"CA",{"$f":"IF(Aplicabilidad!G62<>\"SI\",\"NA\",SUM(E38:E45)/SUM(D38:D45))","v":"NA"},{"$f":"IF(Aplicabilidad!G62<>\"SI\",\"NA\",SUM(E70:E78)/SUM(D70:D78))","v":"NA"}]
[null,null,"OBLIGACIÓN",{"$f":"IF(Aplicabilidad!G62<>\"SI\",\"NA\",D87*0.6+D88*0.4)","v":"NA"},{"$f":"IF(Aplicabilidad!G62<>\"SI\",\"NA\",E87*0.6+E88*0.4)","v":"NA"}]

{"sheet":"Art 75_III","index":54,"n_rows":98,"n_cols":7,"rows_kept":98,"hidden":true,"merged":[[0,2,0,6],[4,1,4,7],[14,4,14,6],[49,4,49,6]]}
[null,null,{"$f":"IF(Aplicabilidad!E2=\"\",\"\",Aplicabilidad!E2)","v":"Consejería Jurídica"}]
[]
[null,"Códigos de valoración : Cumplió totalmente = 1; Cumplió parcialmente = 0.5; No cumplió = 0; Justificado = Justificado"]
[]
[null,"Art. 75 - Fracción III. Expropiaciones realizadas"]
[]
[null,null,"Fecha de Inicio de la Verificación:",{"$nulls":3},"Fecha de Término de la verificación"]
[null,null,{"$f":"IF(Resultados!$C$7=\"\",\"\",Resultados!$C$7)","v":"2021-07-07"},"2018-05-25",null,null,{"$f":"IF(Resultados!G7=\"\",\"\",Resultados!G7)","v":"2021-07-08"}]
[]
[null,null,"Criterios Sustantivos",null,{"$f":"IF(Aplicabilidad!G63<>\"SI\",\"NA\",(SUM(E19:E35)+SUM(E54:E74))/(SUM(D19:D35)+SUM(D54:D74)))","v":"NA"}]
[null,null,"Criterios Adjetivos",null,{"$f":"IF(Aplicabilidad!G63<>\"SI\",\"NA\",(SUM(E40:E47)+SUM(E79:E87))/(SUM(D40:D47)+SUM(D79:D87)))","v":"NA"}]
[null,null,"Obligación",null,{"$f":"IF(Aplicabilidad!G63<>\"SI\",\"NA\",E10*0.6+E11*0.4)","v":"NA"}]
[]
[]
[]
[null,null,"Criterios Sustantivos de contenido \nLTG 2018 - LTG 2020 (DOF 28/12/20) ",{"$f":"COUNTA(F19:F47)","v":1}]
[]
[null,null,"Criterio",null,"Valoración","Tipo","Observaciones, Recomendaciones y/o Requerimientos"]
[null,null,"Criterio 1. Ejercicio",{"$f":"IF(E19=\"Justificado\",0,1)","v":1}]
[null,null,"Criterio 2. Periodo que se informa",{"$f":"IF(E20=\"Justificado\",0,1)","v":1}]
[null,null,"Criterio 3. Tipo de expropiación: Decretadas/Ejecutadas",1]
[null,null,"Criterio 4. Nombre de la autoridad administrativa expropiante",1]
[null,null,"Criterio 5. Nombre de la persona física o razón social de la persona moral expropiada, en su caso",1]
[null,null,"Criterio 6. Domicilio del predio expropiado (tipo de vialidad [catálogo], nombre de vialidad [calle], número exterior, número interior [en su caso], tipo de asentamiento humano [catálogo], nombre de asentamiento humano [colonia], clave de la localidad [catálogo], nombre de la localidad [catálogo], clave del municipio [catálogo], nombre del municipio o delegación [catálogo], clave de la entidad federativa [catálogo], nombre de la entidad federativa [catálogo], código postal)",1]
[null,null,"Criterio 7. Tipo de propiedad objeto de la expropiación",1]
[null,null,"Criterio 8. Hipervínculo al polígono o plano del bien expropiado",1]
[null,null,"Criterio 9. Causa de utilidad pública por la que se expropió el bien",1]
[null,null,"Criterio 10. Fecha de publicación del decreto o declaratoria de expropiación en el Diario Oficial de la Federación, periódico o gaceta oficial correspondiente con el formato día/mes/año (por ej. 31/Marzo/2016)",1]
[null,null,"Criterio 11. Hipervínculo al Decreto o Declaratoria de expropiación (en donde se fundamenta y motiva la causa de utilidad pública)",1]
[null,null,"Criterio 12. Fecha de ejecución de expropiación con el formato día/mes/año (por ej. 31/Marzo/2016)",1]
[null,null,"Criterio 13. Nombre de la autoridad administrativa que ejecutó la expropiación",1]
[null,null,"Criterio 14. Destino que se le dio al bien expropiado",1]
[null,null,"Criterio 15. Monto de la indemnización por la Ocupación superficial del bien",1]
[null,null,"Criterio 16. Monto de la indemnización por el bien expropiado, en su caso",{"$f":"IF(E34=\"Justificado\",0,1)","v":1}]
[null,null,"Criterio 17. Hipervínculo a los documentos que dan inicio al procedimientos de expropiación y/o expediente",{"$f":"IF(E35=\"Justificado\",0,1)","v":1}]
[]
[null,null,"Criterios Adjetivos LTG 2015-2017"]
[]
[null,null,"Criterio",null,"Valoración","Tipo","Observaciones, Recomendaciones y/o Requerimientos"]
[null,null,"Criterio 18. Periodo de actualización de la información: trimestral",{"$f":"IF(E40=\"Justificado\",0,1)","v":1}]
[null,null,"Criterio 19. La información publicada deberá estar actualizada al periodo que corresponde de acuerdo con la Tabla de actualización y conservación de la información",1]
[null,null,"Criterio 20. Conservar en el sitio de Internet y a través de la Plataforma Nacional la información de acuerdo con la Tabla de actualización y conservación de la información",1]
[null,null,"Criterio 21. Área(s) o unidad(es) administrativa(s) que genera(n) o posee(n) la información respectiva y son responsables de publicarla y actualizarla",1]
[null,null,"Criterio 22. Fecha de actualización de la información publicada con el formato día/mes/año (por ej. 31/Marzo/2016)",1]
[null,null,"Criterio 23. Fecha de validación de la información publicada con el formato día/mes/año (por ej. 31/Marzo/2016)",1]
[null,null,"Criterio 24. La información publicada se organiza mediante el formato 1c, en el que se incluyen todos los campos especificados en los criterios sustantivos de contenido",1]
[null,null,"Criterio 25. El soporte de la información permite su reutilización",1]
[]
[]
[]
[null,null,"Criterios Sustantivos de contenido LTG 2018 - LTG 2020 (DOF 28/12/20) ",{"$f":"COUNTA(F54:F87)","v":1}]
[]
[null,null,"Criterio",null,"Valoración","Tipo","Observaciones, Recomendaciones y/o Requerimientos"]
[null,null,"Criterio 1. Ejercicio",{"$f":"IF(E54=\"Justificado\",0,1)","v":1}]
[null,null,"Criterio 2. Periodo que se informa (fecha de inicio y fecha de término con el formato día/mes/año)",{"$f":"IF(E55=\"Justificado\",0,1)","v":1}]
[null,null,"Criterio 3. Mensaje: “La publicación y actualización de la información está a cargo de <<incluir la denominación del sujeto obligado>>.”",1]
[null,null,"Criterio 4. Hipervínculo que dirija a la ruta específica hacia la información del sujeto obligado que hayan referido",1]
[null,null,"Criterio 5. Ejercicio",1]
[null,null,"Criterio 6. Periodo que se informa (fecha de inicio y fecha de término con el formato día/mes/año)",1]
[null,null,"Criterio 7. Tipo de expropiación: Decretadas/Ejecutadas",1]
[null,null,"Criterio 8. Nombre de la autoridad administrativa expropiante",1]
[null,null,"Criterio 9. Nombre de la persona física (nombre[s], primer apellido, segundo apellido) o razón social de la persona moral expropiada, en su caso",1]
[null,null,"Criterio 10. Domicilio del predio expropiado (tipo de vialidad [catálogo], nombre de vialidad [calle], número exterior, número interior [en su caso], tipo de asentamiento humano [catálogo], nombre de asentamiento humano [colonia], clave de la localidad, nombre de la localidad, clave del municipio, nombre del municipio o delegación, clave de la entidad federativa, nombre de la entidad federativa [catálogo], código postal)",1]
[null,null,"Criterio 11. Tipo de propiedad objeto de la expropiación",1]
[null,null,"Criterio 12. Hipervínculo al polígono o plano del bien expropiado",1]
[null,null,"Criterio 13. Causa de utilidad pública por la que se expropió el bien",1]
[null,null,"Criterio 14. Fecha de publicación del decreto o declaratoria de expropiación en el Diario Oficial de la Federación, periódico o gaceta oficial correspondiente con el formato día/mes/año ",1]
[null,null,"Criterio 15. Hipervínculo al Decreto o Declaratoria de expropiación (en donde se fundamenta y motiva la causa de utilidad pública)",1]
[null,null,"Criterio 16. Fecha de ejecución de expropiación con el formato día/mes/año ",1]
[null,null,"Criterio 17. Nombre de la autoridad administrativa que ejecutó la expropiación",1]
[null,null,"Criterio 18. Destino que se le dio al bien expropiado",1]
[null,null,"Criterio 19. Monto de la indemnización por la Ocupación superficial del bien",1]
[null,null,"Criterio 20. Monto de la indemnización por el bien expropiado, en su caso",{"$f":"IF(E73=\"Justificado\",0,1)","v":1}]
[null,null,"Criterio 21. Hipervínculo a los documentos que dan inicio a los procedimientos de expropiación y/o expediente",{"$f":"IF(E74=\"Justificado\",0,1)","v":1}]
[]
[null,null,"Criterios Adjetivos LTG 2018 - LTG 2020 (DOF 28/12/20) "]
[]
[null,null,"Criterio",null,"Valoración","Tipo","Observaciones, Recomendaciones y/o Requerimientos"]
[null,null,"Criterio 22. Periodo de actualización de la información: trimestral",{"$f":"IF(E79=\"Justificado\",0,1)","v":1}]
[null,null,"Criterio 23. La información publicada deberá estar actualizada al periodo que corresponde de acuerdo con la Tabla de actualización y conservación de la información",1]
[null,null,"Criterio 24. Conservar en el sitio de Internet y a través de la Plataforma Nacional la información de acuerdo con la Tabla de actualización y conservación de la información",1]
[null,null,"Criterio 25. Área(s) responsable(s) que genera(n) posee(n), publica(n) y/o actualiza(n)la información ",1]
[null,null,"Criterio 26. Fecha de actualización de la información publicada con el formato día/mes/año ",1]
[null,null,"Criterio 27. Fecha de validación de la información publicada con el formato día/mes/año ",1]
[null,null,"Criterio 28. Nota. Este criterio se cumple en caso de que sea necesario que el sujeto obligado incluya alguna aclaración relativa a la información publicada y/o explicación por la falta de información ",1]
[null,null,"Criterio 29. La información publicada se organiza mediante los formatos 1c y 2c en los que se incluyen todos los campos especificados en los criterios sustantivos de contenido",1]
[null,null,"Criterio 30. El soporte de la información permite su reutilización",1]
{"$rows_empty":7}
[{"$nulls":3},2017,2018]
[null,null,"CS",{"$f":"IF(Aplicabilidad!G63<>\"SI\",\"NA\",SUM(E19:E35)/SUM(D19:D35))","v":"NA"},{"$f":"IF(Aplicabilidad!G63<>\"SI\",\"NA\",SUM(E54:E74)/SUM(D54:D74))","v":"NA"}]
[null,null,"CA",{"$f":"IF(Aplicabilidad!G63<>\"SI\",\"NA\",SUM(E40:E47)/SUM(D40:D47))","v":"NA"},{"$f":"IF(Aplicabilidad!G63<>\"SI\",\"NA\",SUM(E79:E87)/SUM(D79:D87))","v":"NA"}]
[null,null,"OBLIGACIÓN",{"$f":"IF(Aplicabilidad!G63<>\"SI\",\"NA\",D96*0.6+D97*0.4)","v":"NA"},{"$f":"IF(Aplicabilidad!G63<>\"SI\",\"NA\",E96*0.6+E97*0.4)","v":"NA"}]

{"sheet":"Art 75_IV","index":55,"n_rows":73,"n_cols":7,"rows_kept":73,"hidden":true,"merged":[[0,2,0,6],[4,1,4,7],[14,4,14,6]]}
[null,null,{"$f":"IF(Aplicabilidad!E2=\"\",\"\",Aplicabilidad!E2)","v":"Consejería Jurídica"}]
[]
[null,"Códigos de valoración : Cumplió totalmente = 1; Cumplió parcialmente = 0.5; No cumplió = 0; Justificado = Justificado"]
[]
[null,"Art. 75 - Fracción IV. Contribuyentes que recibieron cancelación o condonación de créditos fiscales"]
[]
[null,null,"Fecha de Inicio de la Verificación:",{"$nulls":3},"Fecha de Término de la verificación"]
[null,null,{"$f":"IF(Resultados!$C$7=\"\",\"\",Resultados!$C$7)","v":"2021-07-07"},"2018-05-25",null,null,{"$f":"IF(Resultados!G7=\"\",\"\",Resultados!G7)","v":"2021-07-08"}]
[]
[null,null,"Criterios Sustantivos",null,{"$f":"IF(Aplicabilidad!G64<>\"SI\",\"NA\",(+SUM(E19:E49))/(+SUM(D19:D49)))","v":"NA"}]
[null,null,"Criterios Adjetivos",null,{"$f":"IF(Aplicabilidad!G64<>\"SI\",\"NA\",(+SUM(E54:E62))/(+SUM(D54:D62)))","v":"NA"}]
[null,null,"Obligación",null,{"$f":"IF(Aplicabilidad!G64<>\"SI\",\"NA\",E10*0.6+E11*0.4)","v":"NA"}]
[]
[]
[]
[null,null,"Criterios Sustantivos de contenido \nLTG 2018 - LTG 2020 (DOF 28/12/20) ",{"$f":"COUNTA(F19:F62)","v":1}]
[]
[null,null,"Criterio",null,"Valoración","Tipo","Observaciones, Recomendaciones y/o Requerimientos"]
[null,null,"Criterio 1. Ejercicio",{"$f":"IF(E19=\"Justificado\",0,1)","v":1}]
[null,null,"Criterio 2. Periodo que se informa (fecha de inicio y fecha de término con el formato día/mes/año)",{"$f":"IF(E20=\"Justificado\",0,1)","v":1}]
[null,null,"Criterio 3. Mensaje “La publicación y actualización de la información está a cargo de <<incluir la denominación del sujeto obligado>>.”",1]
[null,null,"Criterio 4. Hipervínculo que dirija a la ruta específica hacia la información del sujeto obligado que hayan referido",1]
[null,null,"Criterio 5. Ejercicio",1]
[null,null,"Criterio 6. Periodo que se informa (fecha de inicio y fecha de término con el formato día/mes/año)",1]
[null,null,"Criterio 7. Personería jurídica: Persona física/persona moral",1]
[null,null,"Criterio 8. Nombre completo en el caso de las personas físicas (nombre[s], primer apellido, segundo apellido); razón social si se trata de personas morales, gobiernos o instituciones deudoras que recibieron cancelación o condonación de créditos fiscales",1]
[null,null,"Criterio 9. Registro Federal de Contribuyentes (RFC), de la persona física o moral, gobiernos o instituciones deudoras.",1]
[null,null,"Criterio 10. Entidad Federativa a la que pertenece la persona física o moral",1]
[null,null,"Criterio 11. Fecha de la solicitud de la cancelación o condonación, con formato día/mes/año",1]
[null,null,"Criterio 12. Tipo de crédito fiscal condonado o cancelado (catálogo): Contribuciones federales/ Cuotas compensatorias/ Actualizaciones y accesorios/ Multas",1]
[null,null,"Criterio 13. Monto cancelado o condonado",1]
[null,null,"Criterio 14. Justificación de la cancelación o condonación",1]
[null,null,"Criterio 15. Fecha de la cancelación o condonación, con el formato día/mes/año ",1]
[null,null,"Criterio 16. Denominación de la autoridad externa o interna que determinó el crédito",1]
[null,null,"Criterio 17. Denominación de la autoridad responsable de la cancelación o condonación",1]
[null,null,"Criterio 18. Hipervínculo al listado de Créditos fiscales cancelados o condonados publicados por el SAT",1]
[null,null,"Criterio 19. Ejercicio",1]
[null,null,"Criterio 20. Periodo que se informa (fecha de inicio y fecha de término con el formato día/mes/año)",1]
[null,null,"Criterio 21. Tipo de contribución que se exentó del pago: Contribuciones federales/Cuotas compensatorias/Actualizaciones y accesorios/Multas",1]
[null,null,"Criterio 22. Número total por tipo de crédito fiscal que se exenta del pago",1]
[null,null,"Criterio 23. Monto total por tipo de crédito fiscal que se exenta del pago",1]
[null,null,"Criterio 24. Número total (global) de exenciones",1]
[null,null,"Criterio 25. Monto total (global) de las exenciones",1]
[null,null,"Criterio 26. Estadística de las causas o motivos de las condonaciones o exenciones",1]
[null,null,"Criterio 27. Denominación de los documentos técnicos, metodológicos relacionados con las normas científicas sobre las fuentes, métodos, procedimientos de la estadística y el manejo de las bases de datos",1]
[null,null,"Criterio 28. Hipervínculo a los documentos técnicos, metodológicos relacionados con las normas científicas sobre las fuentes, métodos, procedimientos de la estadística y el manejo de las bases de datos",1]
[null,null,"Criterio 29. Tipos de archivo de las bases de datos: HTML, XLS, IQY, CSV, XML, SAV, otro",1]
[null,null,"Criterio 30. Hipervínculo a las bases de datos respectivas. Las bases de datos deberán corresponder directamente con el proyecto que se está informando",{"$f":"IF(E48=\"Justificado\",0,1)","v":1}]
[null,null,"Criterio 31. Hipervínculo a las series o bancos de datos existentes. Las series o banco de datos deberán corresponder directamente con el tema estadístico que se está informando",{"$f":"IF(E49=\"Justificado\",0,1)","v":1}]
[]
[null,null,"Criterios Adjetivos LTG 2018 - LTG 2020 (DOF 28/12/20) "]
[]
[null,null,"Criterio",null,"Valoración","Tipo","Observaciones, Recomendaciones y/o Requerimientos"]
[null,null,"Criterio 32. Periodo de actualización de la información: trimestral",{"$f":"IF(E54=\"Justificado\",0,1)","v":1}]
[null,null,"Criterio 33. La información publicada deberá estar actualizada al periodo que corresponde de acuerdo con la Tabla de actualización y conservación de la información",1]
[null,null,"Criterio 34. Conservar en el sitio de Internet y a través de la Plataforma Nacional la información de acuerdo con la Tabla de actualización y conservación de la información",1]
[null,null,"Criterio 35. Área(s) responsable(s) que genera(n) posee(n), publica(n) y/o actualiza(n)la información ",1]
[null,null,"Criterio 36. Fecha de actualización de la información publicada con el formato día/mes/año  ",1]
[null,null,"Criterio 37. Fecha de validación de la información publicada con el formato día/mes/año  ",1]
[null,null,"Criterio 38. Nota. Este criterio se cumple en caso de que sea necesario que el sujeto obligado incluya alguna aclaración relativa a la información publicada y/o explicación por la falta de información ",1]
[null,null,"Criterio 39. La información publicada se organiza mediante los formatos 1d, 2d, y 3d en los que se incluyen todos los campos especificados en los criterios sustantivos de contenido",1]
[null,null,"Criterio 40. El soporte de la información permite su reutilización",1]
{"$rows_empty":7}
[{"$nulls":3},2017,2018]
[null,null,"CS","NA",{"$f":"IF(Aplicabilidad!G64<>\"SI\",\"NA\",SUM(E19:E49)/SUM(D19:D49))","v":"NA"}]
[null,null,"CA","NA",{"$f":"IF(Aplicabilidad!G64<>\"SI\",\"NA\",SUM(E54:E62)/SUM(D54:D62))","v":"NA"}]
[null,null,"OBLIGACIÓN","NA",{"$f":"IF(Aplicabilidad!G64<>\"SI\",\"NA\",E71*0.6+E72*0.4)","v":"NA"}]

{"sheet":"Art 75_V","index":56,"n_rows":77,"n_cols":7,"rows_kept":77,"hidden":true,"merged":[[0,2,0,6],[4,1,4,7],[14,4,14,6]]}
[null,null,{"$f":"IF(Aplicabilidad!E2=\"\",\"\",Aplicabilidad!E2)","v":"Consejería Jurídica"}]
[]
[null,"Códigos de valoración : Cumplió totalmente = 1; Cumplió parcialmente = 0.5; No cumplió = 0; Justificado = Justificado"]
[]
[null,"Art. 75 - Fracción V. Los nombres de las personas a quienes se les habilitó para ejercer como corredores y notarios públicos"]
[]
[null,null,"Fecha de Inicio de la Verificación:",{"$nulls":3},"Fecha de Término de la verificación"]
[null,null,{"$f":"IF(Resultados!$C$7=\"\",\"\",Resultados!$C$7)","v":"2021-07-07"},"2018-05-25",null,null,{"$f":"IF(Resultados!G7=\"\",\"\",Resultados!G7)","v":"2021-07-08"}]
[]
[null,null,"Criterios Sustantivos",null,{"$f":"IF(Aplicabilidad!G65<>\"SI\",\"NA\",(+SUM(E19:E53))/(+SUM(D19:D53)))","v":"NA"}]
[null,null,"Criterios Adjetivos",null,{"$f":"IF(Aplicabilidad!G65<>\"SI\",\"NA\",(+SUM(E58:E66))/(+SUM(D58:D66)))","v":"NA"}]
[null,null,"Obligación",null,{"$f":"IF(Aplicabilidad!G65<>\"SI\",\"NA\",E10*0.6+E11*0.4)","v":"NA"}]
[]
[]
[]
[null,null,"Criterios Sustantivos de contenido \nLTG 2018 - LTG 2020 (DOF 28/12/20) ",{"$f":"COUNTA(F19:F66)","v":1}]
[]
[null,null,"Criterio",null,"Valoración","Tipo","Observaciones, Recomendaciones y/o Requerimientos"]
[null,null,"Criterio 1. Ejercicio",{"$f":"IF(E19=\"Justificado\",0,1)","v":1}]
[null,null,"Criterio 2. Periodo que se informa (fecha de inicio y fecha de término con el formato día/mes/año)",{"$f":"IF(E20=\"Justificado\",0,1)","v":1}]
[null,null,"Criterio 3. Mensaje: “La publicación y actualización de la información está a cargo de <<incluir la denominación del sujeto obligado>>”",1]
[null,null,"Criterio 4. Hipervínculo al portal de transparencia del sujeto obligado que hayan referido",1]
[null,null,"Criterio 5. Ejercicio",1]
[null,null,"Criterio 6. Periodo que se informa (fecha de inicio y fecha de término con el formato día/mes/año)",1]
[null,null,"Criterio 7. Tipo de patente o habilitación: Corredor público/Notario",1]
[null,null,"Criterio 8. Nombre completo (nombre[s], primer apellido, segundo apellido)",1]
[null,null,"Criterio 9. Número de correduría o notaría a la que pertenece",1]
[null,null,"Criterio 10. Número de registro o documento que lo (la autoriza, la patente o habilitación (por ejemplo: en el caso de notario, el número de fiat notarial)",1]
[null,null,"Criterio 11. Fecha en que comenzó a ejercer funciones, con el formato mes/año",1]
[null,null,"Criterio 12. Tipo de servicios que ofrece (testamentos, poderes, constitución de sociedades; así como de aquéllos cuyo objeto sean inmuebles, por ejemplo: compraventas, donaciones, hipotecas, fideicomisos y adjudicaciones por herencia)",1]
[null,null,"Criterio 13. Domicilio de la correduría o notaría (tipo de vialidad [catálogo], nombre de vialidad [calle], número exterior, número interior [en su caso], tipo de asentamiento humano [catálogo], nombre de asentamiento humano [colonia], clave de la localidad, nombre de la localidad, clave del municipio, nombre del municipio o delegación, clave de la entidad federativa, nombre de la entidad federativa [catálogo], código postal)",1]
[null,null,"Criterio 14. Número(s) de teléfono oficial(es) y extensión(es)/Fax",1]
[null,null,"Criterio 15. Dirección de correo electrónico oficial",1]
[null,null,"Criterio 16. Hipervínculo al padrón de Notarios Públicos registrados por el SAT",1]
[null,null,"Criterio 17. Hipervínculo al padrón de Corredores incluido en el SAT",1]
[null,null,"Criterio 18. Descripción del proceso de habilitación o nombramiento (breve descripción de las etapas en las que consiste el proceso, de acuerdo con la legislación correspondiente)",1]
[null,null,"Criterio 19. Hipervínculo a la convocatoria",1]
[null,null,"Criterio 20. Hipervínculo a los requisitos",1]
[null,null,"Criterio 21. Hipervínculo al resultado del examen para aspirante",1]
[null,null,"Criterio 22. Hipervínculo al resultado del examen definitivo",1]
[null,null,"Criterio 23. Hipervínculo al currículum del notario o corredor público (en versión pública)",1]
[null,null,"Criterio 24. Fecha de habilitación o nombramiento con el formato mes/año",1]
[null,null,"Criterio 25. Plaza (entidad federativa o Ciudad de México)",1]
[null,null,"Criterio 26. Estatus de la habilitación o nombramiento: En trámite/En ejercicio/En separación/En suspensión/Cancelada/Otro (especificar)",1]
[null,null,"Criterio 27. Ejercicio",1]
[null,null,"Criterio 28. Periodo que se informa (fecha de inicio y fecha de término con el formato día/mes/año)",1]
[null,null,"Criterio 29. Nombre del corredor o notario sancionado",1]
[null,null,"Criterio 30. Número de notaria o correduría a la que pertenece",1]
[null,null,"Criterio 31. Tipo de sanción recibida, de acuerdo con la legislación correspondiente: Amonestación/Multas (especificar monto)/Suspensión temporal (especificar periodo en número de días)/Cesación de funciones/Cancelación/Otra (especificar)",1]
[null,null,"Criterio 32. Motivo de la sanción",1]
[null,null,"Criterio 33. Fecha de la sanción, con el formato día/mes/año ",1]
[null,null,"Criterio 34. Fundamento jurídico por el que se le sancionó (Denominación de la normatividad, artículo, fracción o inciso)",{"$f":"IF(E52=\"Justificado\",0,1)","v":1}]
[null,null,"Criterio 35. Estatus del cumplimiento de sanción: En proceso/Cumplida/No atendida",{"$f":"IF(E53=\"Justificado\",0,1)","v":1}]
[]
[null,null,"Criterios Adjetivos LTG 2018 - LTG 2020 (DOF 28/12/20) "]
[]
[null,null,"Criterio",null,"Valoración","Tipo","Observaciones, Recomendaciones y/o Requerimientos"]
[null,null,"Criterio 36. Periodo de actualización de la información: trimestral",{"$f":"IF(E58=\"Justificado\",0,1)","v":1}]
[null,null,"Criterio 37. La información publicada deberá estar actualizada al periodo que corresponde de acuerdo con la Tabla de actualización y conservación de la información",1]
[null,null,"Criterio 38. Conservar en el sitio de Internet y a través de la Plataforma Nacional la información de acuerdo con la Tabla de actualización y conservación de la información",1]
[null,null,"Criterio 39. Área(s) responsable(s) que genera(n) posee(n), publica(n) y/o actualiza(n)la información ",1]
[null,null,"Criterio 40. Fecha de actualización de la información publicada con el formato día/mes/año ",1]
[null,null,"Criterio 41. Fecha de validación de la información publicada con el formato día/mes/año ",1]
[null,null,"Criterio 42. Nota. Este criterio se cumple en caso de que sea necesario que el sujeto obligado incluya alguna aclaración relativa a la información publicada y/o explicación por la falta de información ",1]
[null,null,"Criterio 43. La información publicada se organiza mediante los formatos 1e, 2e y 3e, en los que se incluyen todos los campos especificados en los criterios sustantivos de contenido",1]
[null,null,"Criterio 44. El soporte de la información permite su reutilización",1]
{"$rows_empty":7}
[{"$nulls":3},2017,2018]
[null,null,"CS","NA",{"$f":"IF(Aplicabilidad!G65<>\"SI\",\"NA\",SUM(E19:E53)/SUM(D19:D53))","v":"NA"}]
[null,null,"CA","NA",{"$f":"IF(Aplicabilidad!G65<>\"SI\",\"NA\",SUM(E58:E66)/SUM(D58:D66))","v":"NA"}]
[null,null,"OBLIGACIÓN","NA",{"$f":"IF(Aplicabilidad!G65<>\"SI\",\"NA\",E75*0.6+E76*0.4)","v":"NA"}]

{"sheet":"Art 71_I_F","index":57,"n_rows":145,"n_cols":7,"rows_kept":145,"hidden":true,"merged":[[0,2,0,6],[4,1,4,7],[14,4,14,6],[69,4,69,6]]}
[null,null,{"$f":"IF(Aplicabilidad!E2=\"\",\"\",Aplicabilidad!E2)","v":"Consejería Jurídica"}]
[]
[null,"Códigos de valoración : Cumplió totalmente = 1; Cumplió parcialmente = 0.5; No cumplió = 0; Justificado = Justificado"]
[]
[null,"Art. 71 - Fracción I - Inciso F. Planes de desarrollo urbano"]
[]
[null,null,"Fecha de Inicio de la Verificación:",{"$nulls":3},"Fecha de Término de la verificación"]
[null,null,{"$f":"IF(Resultados!$C$7=\"\",\"\",Resultados!$C$7)","v":"2021-07-07"},"2018-05-25",null,null,{"$f":"IF(Resultados!G7=\"\",\"\",Resultados!G7)","v":"2021-07-08"}]
[]
[null,null,"Criterios Sustantivos",null,{"$f":"IF(Aplicabilidad!G66<>\"SI\",\"NA\",(SUM(E19:E55)+SUM(E74:E121))/(SUM(D19:D55)+SUM(D74:D121)))","v":"NA"}]
[null,null,"Criterios Adjetivos",null,{"$f":"IF(Aplicabilidad!G66<>\"SI\",\"NA\",(SUM(E60:E67)+SUM(E126:E134))/(SUM(D60:D67)+SUM(D126:D134)))","v":"NA"}]
[null,null,"Obligación",null,{"$f":"IF(Aplicabilidad!G66<>\"SI\",\"NA\",E10*0.6+E11*0.4)","v":"NA"}]
[]
[]
[]
[null,null,"Criterios Sustantivos de contenido \nLTG 2018 - LTG 2020 (DOF 28/12/20) ",{"$f":"COUNTA(F19:F67)","v":1}]
[]
[null,null,"Criterio",null,"Valoración","Tipo","Observaciones, Recomendaciones y/o Requerimientos"]
[null,null,"Criterio 1. Ejercicio",{"$f":"IF(E19=\"Justificado\",0,1)","v":1}]
[null,null,"Criterio 2. Denominación del Plan y/o Programa de Desarrollo Urbano",{"$f":"IF(E20=\"Justificado\",0,1)","v":1}]
[null,null,"Criterio 3. Hipervínculo al documento completo del Plan o Programa Federal, Estatal, de la Ciudad de México, municipal",1]
[null,null,"Criterio 4. Lineamientos por objetivos del Plan (o planes) Federal, Estatal, de la Ciudad de México, Municipal",1]
[null,null,"Criterio 5. Hipervínculo a los documentos de mapas de apoyo explicativos de los Planes, o en su caso, a los mapas georreferenciados para la visualización de los terrenos a través de imágenes satelitales de los mismos",1]
[null,null,"Criterio 6. Hipervínculo al documento completo de los Planes y programas de ordenamiento territorial",1]
[null,null,"Criterio 7. Lineamientos por objetivo del Plan (o planes) Federal, Estatal, de la Ciudad de México, municipal",1]
[null,null,"Criterio 8. Hipervínculo a los documentos de mapas de apoyo explicativos de los Planes, o en su caso, a los mapas georreferenciados para la visualización de los terrenos a través de imágenes satelitales de los mismos",1]
[null,null,"Criterio 9. Hipervínculo al documento completo de los Planes y programas de ordenamiento ecológico",1]
[null,null,"Criterio 10. Lineamientos por objetivo del Plan (o planes) Federal, estatal, de la Ciudad de México, municipal",1]
[null,null,"Criterio 11. Hipervínculo a los documentos de mapas de apoyo explicativos de los Planes, o en su caso, a los mapas georreferenciados para la visualización de los terrenos a través de imágenes satelitales de los mismos",1]
[null,null,"Criterio 12. Ejercicio",1]
[null,null,"Criterio 13. Periodo que se informa (enero-marzo, abril-junio, julio-septiembre, octubre-diciembre)",1]
[null,null,"Criterio 14. Listado con los tipos de uso de suelo",1]
[null,null,"Criterio 15. Hipervínculo a los mapas con tipología de uso del suelo",1]
[null,null,"Criterio 16. Número total de cambios de uso de suelo solicitados",1]
[null,null,"Criterio 17. Número total de cambios de uso de suelo autorizados",1]
[null,null,"Criterio 18. Ejercicio",1]
[null,null,"Criterio 19. Periodo que se informa",1]
[null,null,"Criterio 20. Listado de solicitudes de licencias de uso de suelo por tipo",1]
[null,null,"Criterio 21. Objeto de las licencias de uso de suelo",1]
[null,null,"Criterio 22. Nombre o denominación de la persona física o moral que solicita la licencia",1]
[null,null,"Criterio 23. Domicilio de donde se solicita la licencia de uso de suelo (tipo de vialidad [catálogo], nombre de vialidad [calle], número exterior, número interior [en su caso], tipo de asentamiento humano [catálogo], nombre de asentamiento humano [colonia], clave de la localidad [catálogo], nombre de la localidad [catálogo], clave del municipio [catálogo], nombre del municipio o delegación [catálogo], clave de la entidad federativa [catálogo], nombre de la entidad federativa [catálogo], código postal)",1]
[null,null,"Criterio 24. Periodo de vigencia expresado en el formato día/mes/año (por ej. 31/Marzo/2016)",1]
[null,null,"Criterio 25. Fecha de inicio de la licencia, con el formato mes año (por ej. 31/Marzo/2016)",1]
[null,null,"Criterio 26. Fecha de término de la licencia, con el formato mes año (por ej. 31/Marzo/2016)",1]
[null,null,"Criterio 27. Bienes, servicios y/o recursos públicos que aprovechará el titular de la licencia o, en su caso, señalar que no hay aprovechamiento de bien alguno",1]
[null,null,"Criterio 28. Ejercicio",1]
[null,null,"Criterio 29. Periodo que se informa",1]
[null,null,"Criterio 30. Listado de las licencias de construcción autorizadas",1]
[null,null,"Criterio 31. Objeto de las licencias de construcción",1]
[null,null,"Criterio 32. Nombre o denominación de la persona física o moral que solicita la licencia",1]
[null,null,"Criterio 33. Domicilio de donde se solicita la licencia de construcción (tipo de vialidad [catálogo], nombre de vialidad [calle], número exterior, número interior [en su caso], tipo de asentamiento humano [catálogo], nombre de asentamiento humano [colonia], clave de la localidad [catálogo], nombre de la localidad [catálogo], clave del municipio [catálogo], nombre del municipio o delegación [catálogo], clave de la entidad federativa [catálogo], nombre de la entidad federativa [catálogo], código postal)",1]
[null,null,"Criterio 34. Hipervínculo a la solicitud de licencia",1]
[null,null,"Criterio 35. Periodo de vigencia señalando inicio y término en el formato día/mes/año (por ej. 31/Marzo/2016)",1]
[null,null,"Criterio 36. Especificación de los bienes, servicios y/o recursos públicos que aprovechará el titular o, en su caso, señalar que no hay aprovechamiento de bien alguno",{"$f":"IF(E54=\"Justificado\",0,1)","v":1}]
[null,null,"Criterio 37. Hipervínculo a los documentos con los contenidos completos de la licencia",{"$f":"IF(E55=\"Justificado\",0,1)","v":1}]
[]
[null,null,"Criterios Adjetivos LTG 2015-2017"]
[]
[null,null,"Criterio",null,"Valoración","Tipo","Observaciones, Recomendaciones y/o Requerimientos"]
[null,null,"Criterio 38. Periodo de actualización de la información: anual. En el caso del Poder Ejecutivo Federal, Estatales y de la Ciudad de México, trianual o cuatrienal. Los municipios actualizarán sus planes cada tres o cuatro años según corresponda. Respecto a los tipos de uso del suelo, licencias de uso y construcción: trimestral",{"$f":"IF(E60=\"Justificado\",0,1)","v":1}]
[null,null,"Criterio 39. La información publicada deberá estar actualizada al periodo que corresponde de acuerdo con la Tabla de actualización y conservación de la información",1]
[null,null,"Criterio 40. Conservar en el sitio de Internet y a través de la Plataforma Nacional la información de acuerdo con la Tabla de actualización y conservación de la información",1]
[null,null,"Criterio 41. Área(s) o unidad(es) administrativa(s) que genera(n) o posee(n) la información respectiva y son responsables de publicarla y actualizarla",1]
[null,null,"Criterio 42. Fecha de actualización de la información publicada con el formato día/mes/año (por ej. 31/Marzo/2016)",1]
[null,null,"Criterio 43. Fecha de validación de la información publicada con el formato día/mes/año (por ej. 31/Marzo/2016)",1]
[null,null,"Criterio 44. La información publicada se organiza mediante el formato 1f, 2f 3f, 4f, 5f y 6f en los que se incluyen todos los campos especificados en los criterios sustantivos de contenido",1]
[null,null,"Criterio 45. El soporte de la información permite su reutilización",1]
[]
[]
[]
[null,null,"Criterios Sustantivos de contenido LTG 2018 - LTG 2020 (DOF 28/12/20) ",{"$f":"COUNTA(F74:F134)","v":1}]
[]
[null,null,"Criterio",null,"Valoración","Tipo","Observaciones, Recomendaciones y/o Requerimientos"]
[null,null,"Criterio 1. Ejercicio",{"$f":"IF(E74=\"Justificado\",0,1)","v":1}]
[null,null,"Criterio 2. Periodo que se informa (fecha de inicio y fecha de término con el formato día/mes/año)",{"$f":"IF(E75=\"Justificado\",0,1)","v":1}]
[null,null,"Criterio 3. Mensaje: “La publicación y actualización de la información está a cargo de <<incluir la denominación del sujeto obligado>>”",1]
[null,null,"Criterio 4. Hipervínculo al portal de transparencia del sujeto obligado que hayan referido",1]
[null,null,"Criterio 5. Ejercicio",1]
[null,null,"Criterio 6. Periodo que se informa (fecha de inicio y fecha de término con el formato día/mes/año)",1]
[null,null,"Criterio 7. Denominación del Plan y/o Programa de Desarrollo Urbano",1]
[null,null,"Criterio 8. Hipervínculo al documento completo del Plan o Programa Federal, Estatal, de la Ciudad de México, municipal",1]
[null,null,"Criterio 9. Lineamientos por objetivos del Plan (o planes) Federal, Estatal, de la Ciudad de México, Municipal",1]
[null,null,"Criterio 10. Hipervínculo a los documentos de mapas de apoyo explicativos de los Planes, o en su caso, a los mapas georreferenciados para la visualización de los terrenos a través de imágenes satelitales de los mismos",1]
[null,null,"Criterio 11. Ejercicio",1]
[null,null,"Criterio 12. Periodo que se informa (fecha de inicio y fecha de término con el formato día/mes/año)",1]
[null,null,"Criterio 13. Denominación del programa de ordenamiento territorial",1]
[null,null,"Criterio 14. Hipervínculo al documento completo de los Planes y programas de ordenamiento territorial",1]
[null,null,"Criterio 15. Lineamientos por objetivo del Plan (o planes) Federal, Estatal, de la Ciudad de México, municipal",1]
[null,null,"Criterio 16. Hipervínculo a los documentos de mapas de apoyo explicativos de los Planes, o en su caso, a los mapas georreferenciados para la visualización de los terrenos a través de imágenes satelitales de los mismos",1]
[null,null,"Criterio 17. Ejercicio",1]
[null,null,"Criterio 18. Periodo que se informa (fecha de inicio y fecha de término con el formato día/mes/año)",1]
[null,null,"Criterio 19. Denominación del programa de ordenamiento ecológico",1]
[null,null,"Criterio 20. Hipervínculo al documento completo de los Planes y programas de ordenamiento ecológico",1]
[null,null,"Criterio 21. Lineamientos por objetivo del Plan (o planes) Federal, estatal, de la Ciudad de México, municipal",1]
[null,null,"Criterio 22. Hipervínculo a los documentos de mapas de apoyo explicativos de los Planes, o en su caso, a los mapas georreferenciados para la visualización de los terrenos a través de imágenes satelitales de los mismos",1]
[null,null,"Criterio 23. Ejercicio",1]
[null,null,"Criterio 24. Periodo que se informa (fecha de inicio y fecha de término con el formato día/mes/año)",1]
[null,null,"Criterio 25. Hipervínculo al listado con los tipos de uso de suelo",1]
[null,null,"Criterio 26. Hipervínculo a los mapas con tipología de uso del suelo",1]
[null,null,"Criterio 27. Número total de cambios de uso de suelo solicitados",1]
[null,null,"Criterio 28. Número total de cambios de uso de suelo autorizados",1]
[null,null,"Criterio 29. Ejercicio",1]
[null,null,"Criterio 30. Periodo que se informa (fecha de inicio y fecha de término con el formato día/mes/año)",1]
[null,null,"Criterio 31. Denominación de la licencia de uso de suelo ",1]
[null,null,"Criterio 32. Objeto de las licencias de uso de suelo",1]
[null,null,"Criterio 33. Nombre o denominación de la persona física o moral que solicita la licencia",1]
[null,null,"Criterio 34. Domicilio de donde se solicita la licencia de uso de suelo (tipo de vialidad [catálogo], nombre de vialidad [calle], número exterior, número interior [en su caso], tipo de asentamiento humano [catálogo], nombre de asentamiento humano [colonia], clave de la localidad, nombre de la localidad, clave del municipio, nombre del municipio o delegación, clave de la entidad federativa, nombre de la entidad federativa [catálogo], código postal)",1]
[null,null,"Criterio 35. Periodo de vigencia expresado en el formato día/mes/año ",1]
[null,null,"Criterio 36. Fecha de inicio de la licencia, con el formato mes año ",1]
[null,null,"Criterio 37. Fecha de término de la licencia, con el formato mes año",1]
[null,null,"Criterio 38. Bienes, servicios y/o recursos públicos que aprovechará el titular de la licencia o, en su caso, señalar que no hay aprovechamiento de bien alguno",1]
[null,null,"Criterio 39. Ejercicio",1]
[null,null,"Criterio 40. Periodo que se informa (fecha de inicio y fecha de término con el formato día/mes/año)",1]
[null,null,"Criterio 41. Denominación y/o tipo de licencia de construcción autorizada",1]
[null,null,"Criterio 42. Objeto de las licencias de construcción",1]
[null,null,"Criterio 43. Nombre o denominación de la persona física o moral que solicita la licencia",1]
[null,null,"Criterio 44. Domicilio de donde se solicita la licencia de construcción (tipo de vialidad [catálogo], nombre de vialidad [calle], número exterior, número interior [en su caso], tipo de asentamiento humano [catálogo], nombre de asentamiento humano [colonia], clave de la localidad, nombre de la localidad, clave del municipio, nombre del municipio o delegación, clave de la entidad federativa, nombre de la entidad federativa [catálogo], código postal)",1]
[null,null,"Criterio 45. Hipervínculo a la solicitud de licencia",1]
[null,null,"Criterio 46. Periodo de vigencia señalando inicio y término en el formato día/mes/año ",1]
[null,null,"Criterio 47. Especificación de los bienes, servicios y/o recursos públicos que aprovechará el titular o, en su caso, señalar que no hay aprovechamiento de bien alguno",{"$f":"IF(E120=\"Justificado\",0,1)","v":1}]
[null,null,"Criterio 48 . Hipervínculo a los documentos con los contenidos completos de la licencia",{"$f":"IF(E121=\"Justificado\",0,1)","v":1}]
[]
[null,null,"Criterios Adjetivos LTG 2018 - LTG 2020 (DOF 28/12/20) "]
[]
[null,null,"Criterio",null,"Valoración","Tipo","Observaciones, Recomendaciones y/o Requerimientos"]
[null,null,"Criterio 49 . Periodo de actualización de la información: anual. En el caso del Poder Ejecutivo Federal, Estatales y de la Ciudad de México, trianual o cuatrienal. Los municipios actualizarán sus planes cada tres o cuatro años según corresponda. Respecto a los tipos de uso del suelo, licencias de uso y construcción: trimestral",{"$f":"IF(E126=\"Justificado\",0,1)","v":1}]
[null,null,"Criterio 50. La información publicada deberá estar actualizada al periodo que corresponde de acuerdo con la Tabla de actualización y conservación de la información",1]
[null,null,"Criterio 51. Conservar en el sitio de Internet y a través de la Plataforma Nacional la información de acuerdo con la Tabla de actualización y conservación de la información",1]
[null,null,"Criterio 52. Área(s) responsable(s) que genera(n) posee(n), publica(n) y/o actualiza(n)la información ",1]
[null,null,"Criterio 53. Fecha de actualización de la información publicada con el formato día/mes/año  ",1]
[null,null,"Criterio 54. Fecha de validación de la información publicada con el formato día/mes/año ",1]
[null,null,"Criterio 55. Nota. Este criterio se cumple en caso de que sea necesario que el sujeto obligado incluya alguna aclaración relativa a la información publicada y/o explicación por la falta de información",1]
[null,null,"Criterio 56. La información publicada se organiza mediante el formato 1f, 2f 3f, 4f, 5f, 6f y 7f en los que se incluyen todos los campos especificados en los criterios sustantivos de contenido",1]
[null,null,"Criterio 57. El soporte de la información permite su reutilización",1]
{"$rows_empty":7}
[{"$nulls":3},2017,2018]
[null,null,"CS",{"$f":"IF(Aplicabilidad!G66<>\"SI\",\"NA\",SUM(E19:E55)/SUM(D19:D55))","v":"NA"},{"$f":"IF(Aplicabilidad!G66<>\"SI\",\"NA\",SUM(E74:E121)/SUM(D74:D121))","v":"NA"}]
[null,null,"CA",{"$f":"IF(Aplicabilidad!G66<>\"SI\",\"NA\",SUM(E60:E67)/SUM(D60:D67))","v":"NA"},{"$f":"IF(Aplicabilidad!G66<>\"SI\",\"NA\",SUM(E126:E134)/SUM(D126:D134))","v":"NA"}]
[null,null,"OBLIGACIÓN",{"$f":"IF(Aplicabilidad!G66<>\"SI\",\"NA\",D143*0.6+D144*0.4)","v":"NA"},{"$f":"IF(Aplicabilidad!G66<>\"SI\",\"NA\",E143*0.6+E144*0.4)","v":"NA"}]

{"sheet":"Art 75_VI","index":58,"n_rows":50,"n_cols":7,"rows_kept":50,"hidden":true,"merged":[[0,2,0,6],[4,1,4,7],[14,4,14,6]]}
[null,null,{"$f":"IF(Aplicabilidad!E2=\"\",\"\",Aplicabilidad!E2)","v":"Consejería Jurídica"}]
[]
[null,"Códigos de valoración : Cumplió totalmente = 1; Cumplió parcialmente = 0.5; No cumplió = 0; Justificado = Justificado"]
[]
[null,"Art. 75 - Fracción VI. Disposiciones administrativas"]
[]
[null,null,"Fecha de Inicio de la Verificación:",{"$nulls":3},"Fecha de Término de la verificación"]
[null,null,{"$f":"IF(Resultados!$C$7=\"\",\"\",Resultados!$C$7)","v":"2021-07-07"},"2018-05-25",null,null,{"$f":"IF(Resultados!G7=\"\",\"\",Resultados!G7)","v":"2021-07-08"}]
[]
[null,null,"Criterios Sustantivos",null,{"$f":"IF(Aplicabilidad!G67<>\"SI\",\"NA\",(+SUM(E19:E26))/(+SUM(D19:D26)))","v":"NA"}]
[null,null,"Criterios Adjetivos",null,{"$f":"IF(Aplicabilidad!G67<>\"SI\",\"NA\",(+SUM(E31:E39))/(+SUM(D31:D39)))","v":"NA"}]
[null,null,"Obligación",null,{"$f":"IF(Aplicabilidad!G67<>\"SI\",\"NA\",E10*0.6+E11*0.4)","v":"NA"}]
[]
[]
[]
[null,null,"Criterios Sustantivos de contenido \nLTG 2018 - LTG 2020 (DOF 28/12/20) ",{"$f":"COUNTA(F19:F39)","v":1}]
[]
[null,null,"Criterio",null,"Valoración","Tipo","Observaciones, Recomendaciones y/o Requerimientos"]
[null,null,"Criterio 1. Ejercicio",{"$f":"IF(E19=\"Justificado\",0,1)","v":1}]
[null,null,"Criterio 2. Periodo que se informa (fecha de inicio y fecha de término con el formato día/mes/año)",{"$f":"IF(E20=\"Justificado\",0,1)","v":1}]
[null,null,"Criterio 3. Tipo de disposición: Acuerdo/Norma Oficial Mexicana (NOM)/Circular/Formato/Instructivo/Directiva/Otra disposición general)",1]
[null,null,"Criterio 4. Denominación de la disposición",1]
[null,null,"Criterio 5. Fecha de publicación en el DOF u otro medio oficial, expresada con el formato día/mes/año ",1]
[null,null,"Criterio 6. Fecha de última modificación, expresada con el formato día/mes/año ",1]
[null,null,"Criterio 7. En los casos que así corresponda, señalar la vigencia de las disposiciones generales, especificando fecha de inicio y término de la misma en el formato día/mes/año ",{"$f":"IF(E25=\"Justificado\",0,1)","v":1}]
[null,null,"Criterio 8. Hipervínculo al documento completo",{"$f":"IF(E26=\"Justificado\",0,1)","v":1}]
[]
[null,null,"Criterios Adjetivos LTG 2018 - LTG 2020 (DOF 28/12/20) "]
[]
[null,null,"Criterio",null,"Valoración","Tipo","Observaciones, Recomendaciones y/o Requerimientos"]
[null,null,"Criterio 9. Periodo de actualización de la información: trimestral",{"$f":"IF(E31=\"Justificado\",0,1)","v":1}]
[null,null,"Criterio 10. La información publicada deberá estar actualizada al periodo que corresponde de acuerdo con la Tabla de actualización y conservación de la información",1]
[null,null,"Criterio 11. Conservar en el sitio de Internet y a través de la Plataforma Nacional la información de acuerdo con la Tabla de actualización y conservación de la información",1]
[null,null,"Criterio 12. Área(s) responsable(s) que genera(n) posee(n), publica(n) y/o actualiza(n)la información ",1]
[null,null,"Criterio 13. Fecha de actualización de la información publicada con el formato día/mes/año ",1]
[null,null,"Criterio 14. Fecha de validación de la información publicada con el formato día/mes/año ",1]
[null,null,"Criterio 15. Nota. Este criterio se cumple en caso de que sea necesario que el sujeto obligado incluya alguna aclaración relativa a la información publicada y/o explicación por la falta de información",1]
[null,null,"Criterio 16. La información publicada se organiza mediante el formato 1g, en el que se incluyen todos los campos especificados en los criterios sustantivos de contenido",1]
[null,null,"Criterio 17. El soporte de la información permite su reutilización",1]
{"$rows_empty":7}
[{"$nulls":3},2017,2018]
[null,null,"CS","NA",{"$f":"IF(Aplicabilidad!G67<>\"SI\",\"NA\",SUM(E19:E26)/SUM(D19:D26))","v":"NA"}]
[null,null,"CA","NA",{"$f":"IF(Aplicabilidad!G67<>\"SI\",\"NA\",SUM(E31:E39)/SUM(D31:D39))","v":"NA"}]
[null,null,"OBLIGACIÓN","NA",{"$f":"IF(Aplicabilidad!G67<>\"SI\",\"NA\",E48*0.6+E49*0.4)","v":"NA"}]